program: Orca
programVersion: 5.0.2
elementType: Cl O O N C C C C C C C C C C C C C C C C C H H H H H H H H H H H H H H H H H H H H H H H H H H
charge: 0
multiplicity: 1
keywords: wb97x-d3
keywords: def2-TZVPP
keywords: def2/J RIJCOSX
keywords: DEFGRID2
keywords: scfconv7
keywords: smallprint printgap noloewdin
keywords: NOSOSCF
formula: C17H26ClNO2
InChI: InChI=1/C17H26ClNO2/c1-4-11-21-12-10-19(16(20)13-18)17-14(5-2)8-7-9-15(17)6-3/h7-9H,4-6,10-13H2,1-3H3
47 atoms
Cl -3.134582 -2.228461 0.611477
O  2.209565 0.043379 -1.233746
O  -0.165547 -3.330156 1.578472
N  0.21447 -1.28461 0.702351
C  -0.275418 0.012243 0.359293
C  -0.859439 0.201606 -0.902091
C  -0.148064 1.058059 1.280086
C  1.548294 -1.712275 0.265223
C  -0.942369 -0.923542 -1.902277
C  0.452844 0.862783 2.650273
C  2.507806 -0.577477 -0.010118
C  -1.323834 1.472474 -1.220704
C  -0.632568 2.314306 0.918865
C  -0.542516 -2.188909 1.36039
C  -1.212672 2.520003 -0.318788
C  -2.070791 -0.808358 -2.916423
C  1.509828 1.899676 3.015374
C  2.746032 1.339783 -1.354704
C  -1.915511 -1.752548 1.838314
C  2.387219 1.912621 -2.710061
C  2.936867 3.320763 -2.878728
H  1.98491 -2.318437 1.059184
H  1.470441 -2.354537 -0.617291
H  -1.042283 -1.875483 -1.381137
H  0.011319 -0.982209 -2.434778
H  -0.350767 0.897205 3.393096
H  0.890483 -0.131616 2.734968
H  2.4937 0.141877 0.818222
H  3.520686 -1.002164 -0.031137
H  -1.780764 1.656882 -2.184072
H  -0.56326 3.138561 1.618004
H  -1.58489 3.501316 -0.585049
H  -2.10948 -1.708215 -3.53111
H  -1.941213 0.034033 -3.596361
H  -3.040747 -0.700408 -2.42888
H  1.937695 1.674397 3.99292
H  1.102022 2.90917 3.067419
H  2.325822 1.908564 2.290937
H  2.352339 1.988398 -0.557741
H  3.839636 1.321109 -1.23631
H  -2.024959 -0.686454 2.010601
H  -2.150054 -2.288283 2.755368
H  2.781883 1.263286 -3.496367
H  1.299529 1.924927 -2.823492
H  2.686344 3.726403 -3.85923
H  4.024347 3.340877 -2.785117
H  2.528666 4.001567 -2.129287
elementType: Cl O N C H
totalener: -1328.99443651 hartree
nucrepener: 2015.41529148 hartree
electener: -3344.40972799 hartree
oneelecener: -5822.25367626 hartree
twoeener: 2477.84394827 hartree
cpcmener: -0.02662611 hartree
kineticenergy: 1324.24492894 hartree
xcener: -107.422599185430 hartree
chargesum: 0.0000000
charge: -0.156942 -0.357232 -0.505541 0.001470 0.150808 -0.151334 -0.147410 -0.045119 -0.153959 -0.169396 -0.029480 -0.133369 -0.077926 0.292388 -0.171476 -0.269624 -0.264194 0.018709 -0.057506 -0.081838 -0.277300 0.110718 0.110540 0.090071 0.082018 0.095187 0.089375 0.094235 0.108717 0.142603 0.138672 0.154422 0.096394 0.086000 0.086618 0.097156 0.089932 0.083069 0.063804 0.094355 0.138475 0.151098 0.065899 0.059937 0.093949 0.081764 0.081264
qa: -0.1569 -0.3572 -0.5055 0.0015 0.1508 -0.1513 -0.1474 -0.0451 -0.1540 -0.1694 -0.0295 -0.1334 -0.0779 0.2924 -0.1715 -0.2696 -0.2642 0.0187 -0.0575 -0.0818 -0.2773 0.1107 0.1105 0.0901 0.0820 0.0952 0.0894 0.0942 0.1087 0.1426 0.1387 0.1544 0.0964 0.0860 0.0866 0.0972 0.0899 0.0831 0.0638 0.0944 0.1385 0.1511 0.0659 0.0599 0.0939 0.0818 0.0813
va: 1.1205 1.9442 2.0102 2.9663 3.5111 3.7532 3.7444 3.8185 3.8405 3.8606 3.9983 3.7611 3.7878 4.1258 3.9583 3.9347 3.9306 3.9011 3.9645 3.8890 3.9572 1.0176 1.0066 1.0124 1.0201 0.9994 1.0094 0.9833 1.0038 0.9978 0.9990 0.9919 1.0042 0.9999 1.0089 1.0052 1.0022 1.0014 0.9845 0.9962 1.0141 1.0072 1.0135 1.0117 1.0033 1.0024 1.0008
dispcorr: -0.029264934 hartree
energy: -1329.023701443834
dipole: 22.23338 -21.17378 1.05960 22.78618 -20.30728 2.47890 -9.88794 10.21549 0.32755
magnitude: 2.71570 au
magnitude: 6.90275 debye
