program: Orca
programVersion: 5.0.2
elementType: Cl O O N C C C C C C C C C C C C C C C C C H H H H H H H H H H H H H H H H H H H H H H H H H H
charge: 0
multiplicity: 1
keywords: wb97x-d3
keywords: def2-TZVPP
keywords: def2/J RIJCOSX
keywords: DEFGRID2
keywords: scfconv7
keywords: smallprint printgap noloewdin
keywords: NOSOSCF
formula: C17H26ClNO2
InChI: InChI=1/C17H26ClNO2/c1-4-11-21-12-10-19(16(20)13-18)17-14(5-2)8-7-9-15(17)6-3/h7-9H,4-6,10-13H2,1-3H3
47 atoms
Cl -2.686322 -2.131282 1.583613
O  2.463443 0.627381 -0.887474
O  0.645797 -2.769362 1.054158
N  -0.004546 -0.860465 0.040658
C  -0.830532 0.303724 0.00202
C  -1.951769 0.300223 -0.839243
C  -0.500149 1.429158 0.772044
C  0.87059 -1.136201 -1.097317
C  -2.346251 -0.88182 -1.686435
C  0.689107 1.479652 1.700219
C  2.325943 -0.772451 -0.88815
C  -2.736937 1.446729 -0.9039
C  -1.314586 2.554542 0.67225
C  -0.064315 -1.776292 1.032684
C  -2.421949 2.5685 -0.157806
C  -2.183834 -0.617551 -3.181525
C  0.341647 1.90479 3.124265
C  3.702678 1.087415 -0.392747
C  -1.080805 -1.558257 2.13812
C  4.892505 0.77614 -1.287996
C  4.753374 1.329827 -2.697807
H  0.811036 -2.196177 -1.346407
H  0.488534 -0.589352 -1.958259
H  -3.393676 -1.117168 -1.483227
H  -1.783346 -1.77207 -1.409063
H  1.197527 0.517533 1.733757
H  1.417032 2.186576 1.293639
H  2.702478 -1.20808 0.045887
H  2.898281 -1.231143 -1.705157
H  -3.612089 1.454072 -1.543305
H  -1.074681 3.4384 1.250493
H  -3.042001 3.453853 -0.219457
H  -2.475973 -1.495684 -3.75901
H  -1.151732 -0.379168 -3.44179
H  -2.806179 0.214816 -3.512429
H  -0.403063 1.247809 3.576387
H  -0.047642 2.922123 3.167742
H  1.232412 1.872989 3.752836
H  3.600479 2.170906 -0.288185
H  3.884801 0.681596 0.612265
H  -1.19406 -0.524218 2.447763
H  -0.797797 -2.158602 2.99902
H  5.774463 1.207538 -0.806088
H  5.071689 -0.30233 -1.323634
H  4.615105 2.413172 -2.686701
H  3.903693 0.895465 -3.226437
H  5.644714 1.120836 -3.290612
elementType: Cl O N C H
totalener: -1328.99661886 hartree
nucrepener: 1979.50805565 hartree
electener: -3308.50467450 hartree
oneelecener: -5750.70560994 hartree
twoeener: 2442.20093544 hartree
cpcmener: -0.02616873 hartree
kineticenergy: 1324.24095658 hartree
xcener: -107.418884852601 hartree
chargesum: -0.0000000
charge: -0.158338 -0.375223 -0.501905 0.029064 0.112850 -0.153162 -0.142288 -0.019039 -0.164279 -0.178861 -0.029459 -0.076294 -0.084519 0.291174 -0.202279 -0.259356 -0.253271 0.004436 -0.043937 -0.108664 -0.267312 0.109481 0.108583 0.092429 0.076878 0.084000 0.094225 0.096710 0.096909 0.139767 0.143576 0.153984 0.094351 0.084347 0.086063 0.080195 0.086929 0.095514 0.094058 0.090132 0.133318 0.148543 0.072838 0.066677 0.080199 0.079230 0.091727
qa: -0.1583 -0.3752 -0.5019 0.0291 0.1128 -0.1532 -0.1423 -0.0190 -0.1643 -0.1789 -0.0295 -0.0763 -0.0845 0.2912 -0.2023 -0.2594 -0.2533 0.0044 -0.0439 -0.1087 -0.2673 0.1095 0.1086 0.0924 0.0769 0.0840 0.0942 0.0967 0.0969 0.1398 0.1436 0.1540 0.0944 0.0843 0.0861 0.0802 0.0869 0.0955 0.0941 0.0901 0.1333 0.1485 0.0728 0.0667 0.0802 0.0792 0.0917
va: 1.1185 1.9072 2.0036 2.9915 3.6963 3.7591 3.7510 3.7917 3.8866 3.9069 3.9596 3.8100 3.8038 4.1291 3.9836 3.9293 3.9210 3.9037 3.9676 3.8872 3.9344 1.0218 1.0176 1.0017 1.0151 1.0043 1.0013 1.0035 0.9928 0.9987 0.9962 0.9932 1.0046 1.0024 1.0040 1.0050 1.0037 1.0046 0.9903 0.9982 1.0241 1.0098 1.0127 1.0034 1.0010 1.0060 1.0053
dispcorr: -0.027346090 hartree
energy: -1329.023964947029
dipole: 23.64901 -23.09014 0.55887 15.41812 -13.85276 1.56537 -12.83921 12.64289 -0.19633
magnitude: 1.67369 au
magnitude: 4.25419 debye
