program: Orca
programVersion: 5.0.2
elementType: Cl O O N C C C C C C C C C C C C C C C C C H H H H H H H H H H H H H H H H H H H H H H H H H H
charge: 0
multiplicity: 1
keywords: wb97x-d3
keywords: def2-TZVPP
keywords: def2/J RIJCOSX
keywords: DEFGRID2
keywords: scfconv7
keywords: smallprint printgap noloewdin
keywords: NOSOSCF
formula: C17H26ClNO2
InChI: InChI=1/C17H26ClNO2/c1-4-11-21-12-10-19(16(20)13-18)17-14(5-2)8-7-9-15(17)6-3/h7-9H,4-6,10-13H2,1-3H3
47 atoms
Cl -2.06545 -1.499843 2.990704
O  3.348981 0.338504 -0.966119
O  0.976229 -2.079549 1.707458
N  0.094595 -0.343351 0.567291
C  -1.057438 0.417136 0.195529
C  -1.679464 0.18497 -1.037209
C  -1.525739 1.402359 1.074041
C  1.412856 0.253703 0.36754
C  -1.158887 -0.808076 -2.039898
C  -0.839645 1.739429 2.371054
C  2.295687 -0.52326 -0.603438
C  -2.807319 0.933661 -1.360768
C  -2.652721 2.133003 0.707793
C  0.001256 -1.504257 1.251141
C  -3.295445 1.89808 -0.495378
C  -0.375858 -0.116894 -3.154341
C  -0.047413 3.041756 2.27607
C  4.447414 -0.311486 -1.569568
C  -1.381387 -2.098196 1.446475
C  4.15669 -0.898847 -2.941539
C  3.637622 0.119935 -3.944214
H  1.250515 1.252935 -0.034682
H  1.921604 0.369978 1.328065
H  -2.001001 -1.348796 -2.477897
H  -0.52999 -1.558929 -1.561247
H  -1.595195 1.838883 3.153446
H  -0.178325 0.935418 2.691717
H  2.686214 -1.433483 -0.135029
H  1.708567 -0.833196 -1.475425
H  -3.308456 0.753203 -2.304848
H  -3.033502 2.89091 1.382704
H  -4.177357 2.467657 -0.759977
H  0.438782 0.488066 -2.754416
H  -1.018754 0.544764 -3.736771
H  0.05523 -0.84928 -3.838654
H  -0.696257 3.888279 2.04669
H  0.716783 2.992326 1.499472
H  0.453145 3.256616 3.22126
H  5.23074 0.446558 -1.655621
H  4.831966 -1.099434 -0.906718
H  -1.287047 -3.178525 1.529111
H  -2.088812 -1.861985 0.656686
H  5.09196 -1.333789 -3.305518
H  3.454817 -1.734066 -2.858664
H  2.672571 0.532556 -3.646003
H  3.504978 -0.331468 -4.928449
H  4.331292 0.955923 -4.058015
elementType: Cl O N C H
totalener: -1328.99567659 hartree
nucrepener: 1959.11304761 hartree
electener: -3288.10872420 hartree
oneelecener: -5709.36852481 hartree
twoeener: 2421.25980061 hartree
cpcmener: -0.02656863 hartree
kineticenergy: 1324.24763230 hartree
xcener: -107.417506845022 hartree
chargesum: -0.0000000
charge: -0.154904 -0.381575 -0.499505 0.003222 0.123402 -0.124723 -0.157267 -0.042242 -0.172401 -0.146844 -0.019540 -0.072118 -0.075822 0.277758 -0.193773 -0.296359 -0.271128 0.009186 -0.059196 -0.111094 -0.281190 0.108150 0.116898 0.097048 0.087723 0.091847 0.072251 0.103327 0.087765 0.140588 0.141642 0.154838 0.087061 0.099674 0.106969 0.087397 0.089944 0.095306 0.094787 0.087403 0.150017 0.141432 0.075229 0.069173 0.078123 0.094590 0.086929
qa: -0.1549 -0.3816 -0.4995 0.0032 0.1234 -0.1247 -0.1573 -0.0422 -0.1724 -0.1468 -0.0195 -0.0721 -0.0758 0.2778 -0.1938 -0.2964 -0.2711 0.0092 -0.0592 -0.1111 -0.2812 0.1082 0.1169 0.0970 0.0877 0.0918 0.0723 0.1033 0.0878 0.1406 0.1416 0.1548 0.0871 0.0997 0.1070 0.0874 0.0899 0.0953 0.0948 0.0874 0.1500 0.1414 0.0752 0.0692 0.0781 0.0946 0.0869
va: 1.1189 1.9221 2.0115 2.9408 3.5703 3.7774 3.7682 3.7776 3.8640 3.8716 3.9182 3.7990 3.8162 4.1611 3.9750 3.9080 3.9265 3.9307 3.9656 3.8175 3.9413 1.0098 1.0115 1.0027 1.0106 1.0016 1.0173 1.0167 0.9680 0.9977 0.9979 0.9917 0.9908 1.0063 1.0009 1.0036 0.9997 1.0043 0.9949 1.0017 1.0082 1.0115 1.0146 1.0042 1.0008 1.0041 1.0029
dispcorr: -0.027422270 hartree
energy: -1329.023098864855
dipole: 19.72938 -20.44823 -0.71884 10.07938 -9.63302 0.44635 -26.48559 24.63373 -1.85187
magnitude: 2.03602 au
magnitude: 5.17515 debye
