program: Orca
programVersion: 5.0.2
elementType: Cl O O N C C C C C C C C C C C C C C C C C H H H H H H H H H H H H H H H H H H H H H H H H H H
charge: 0
multiplicity: 1
keywords: wb97x-d3
keywords: def2-TZVPP
keywords: def2/J RIJCOSX
keywords: DEFGRID2
keywords: scfconv7
keywords: smallprint printgap noloewdin
keywords: NOSOSCF
formula: C17H26ClNO2
InChI: InChI=1/C17H26ClNO2/c1-4-11-21-12-10-19(16(20)13-18)17-14(5-2)8-7-9-15(17)6-3/h7-9H,4-6,10-13H2,1-3H3
47 atoms
Cl -2.209325 -1.558279 2.789883
O  2.18601 0.448297 -1.143154
O  -0.08507 -3.494538 1.024037
N  0.133464 -1.3403 0.349422
C  -0.462662 -0.051447 0.184542
C  -1.200028 0.225548 -0.974878
C  -0.301995 0.908411 1.191533
C  1.570069 -1.501561 0.132208
C  -1.400511 -0.775967 -2.084334
C  0.512553 0.676085 2.43632
C  2.103996 -0.953127 -1.172236
C  -1.801173 1.476062 -1.091759
C  -0.91162 2.148679 1.027262
C  -0.574802 -2.395493 0.816926
C  -1.662829 2.431553 -0.100153
C  -0.920814 -0.272656 -3.441972
C  1.823185 1.460262 2.422573
C  2.857367 0.986432 -2.260449
C  -2.048203 -2.18085 1.116915
C  2.936182 2.492754 -2.130744
C  1.580504 3.180958 -2.090853
H  2.129325 -1.067994 0.966224
H  1.780967 -2.568562 0.14006
H  -2.465971 -1.016099 -2.152172
H  -0.896952 -1.714278 -1.855122
H  -0.076584 0.988558 3.301719
H  0.718047 -0.383484 2.584172
H  3.104574 -1.388948 -1.306775
H  1.496376 -1.30469 -2.017077
H  -2.3941 1.70185 -1.970075
H  -0.806249 2.896588 1.804831
H  -2.142859 3.396286 -0.205571
H  -1.470625 0.609999 -3.77023
H  -1.057522 -1.042426 -4.202774
H  0.138077 -0.012458 -3.420631
H  2.442324 1.199876 1.563349
H  2.402177 1.258179 3.325436
H  1.643221 2.535829 2.382295
H  3.87066 0.565027 -2.334176
H  2.336554 0.716293 -3.191106
H  -2.552385 -3.143309 1.076295
H  -2.55764 -1.485857 0.456521
H  3.514605 2.751111 -1.238725
H  3.512897 2.859906 -2.983891
H  0.974059 2.918781 -2.960692
H  1.695231 4.265925 -2.088753
H  1.013411 2.915574 -1.198465
elementType: Cl O N C H
totalener: -1328.99535461 hartree
nucrepener: 2032.38674369 hartree
electener: -3361.38209830 hartree
oneelecener: -5856.62859164 hartree
twoeener: 2495.24649335 hartree
cpcmener: -0.02686989 hartree
kineticenergy: 1324.24594671 hartree
xcener: -107.421906668624 hartree
chargesum: -0.0000000
charge: -0.155371 -0.348157 -0.500691 0.012618 0.122900 -0.122493 -0.154847 -0.066963 -0.171593 -0.152966 -0.017015 -0.074903 -0.054144 0.283581 -0.216330 -0.269020 -0.266940 -0.018009 -0.055548 -0.094997 -0.240369 0.116333 0.112916 0.098622 0.087964 0.090000 0.076552 0.108885 0.098728 0.136610 0.135763 0.150808 0.091832 0.100539 0.075132 0.069498 0.097908 0.089410 0.093150 0.085137 0.147305 0.140392 0.062370 0.068731 0.077451 0.098703 0.050519
qa: -0.1554 -0.3482 -0.5007 0.0126 0.1229 -0.1225 -0.1548 -0.0670 -0.1716 -0.1530 -0.0170 -0.0749 -0.0541 0.2836 -0.2163 -0.2690 -0.2669 -0.0180 -0.0555 -0.0950 -0.2404 0.1163 0.1129 0.0986 0.0880 0.0900 0.0766 0.1089 0.0987 0.1366 0.1358 0.1508 0.0918 0.1005 0.0751 0.0695 0.0979 0.0894 0.0931 0.0851 0.1473 0.1404 0.0624 0.0687 0.0775 0.0987 0.0505
va: 1.1193 1.9247 2.0135 2.9965 3.5054 3.7000 3.7478 3.8212 3.8459 3.8665 3.9196 3.7576 3.7426 4.1386 3.9550 3.9377 3.9104 3.9134 3.9566 3.9076 3.9165 1.0007 1.0409 0.9992 1.0127 1.0024 1.0136 1.0005 0.9848 0.9997 0.9994 0.9944 1.0040 1.0062 0.9954 1.0293 1.0052 1.0037 1.0003 0.9787 1.0111 1.0126 1.0113 1.0135 1.0041 1.0085 1.0153
dispcorr: -0.030374546 hartree
energy: -1329.025729154820
dipole: 18.42291 -18.15969 0.26323 18.34857 -17.02540 1.32317 -22.59848 20.77014 -1.82833
magnitude: 2.27219 au
magnitude: 5.77546 debye
