program: Orca
programVersion: 5.0.2
elementType: Cl O O N C C C C C C C C C C C C C C C C C H H H H H H H H H H H H H H H H H H H H H H H H H H
charge: 0
multiplicity: 1
keywords: wb97x-d3
keywords: def2-TZVPP
keywords: def2/J RIJCOSX
keywords: DEFGRID2
keywords: scfconv7
keywords: smallprint printgap noloewdin
keywords: NOSOSCF
formula: C17H26ClNO2
InChI: InChI=1/C17H26ClNO2/c1-4-11-21-12-10-19(16(20)13-18)17-14(5-2)8-7-9-15(17)6-3/h7-9H,4-6,10-13H2,1-3H3
47 atoms
Cl -2.840858 -2.174789 1.378012
O  2.603078 0.317927 -0.742369
O  0.416896 -3.119877 1.27889
N  0.108157 -1.179879 0.158869
C  -0.485345 0.116588 0.08024
C  -1.511519 0.333357 -0.848806
C  -0.01348 1.15249 0.901741
C  1.035239 -1.575524 -0.896641
C  -2.045998 -0.74512 -1.75554
C  1.078318 0.974514 1.928025
C  2.459474 -1.078117 -0.714643
C  -2.057801 1.610182 -0.948225
C  -0.586339 2.413508 0.762121
C  -0.161908 -2.052321 1.155709
C  -1.598033 2.645664 -0.154262
C  -1.729084 -0.488432 -3.226808
C  0.645257 1.325702 3.348709
C  2.402194 0.918589 -2.002484
C  -1.278865 -1.692458 2.117643
C  2.67222 2.405081 -1.895671
C  4.091501 2.746031 -1.469003
H  1.062495 -2.663236 -0.949618
H  0.632334 -1.235198 -1.850438
H  -3.130613 -0.795177 -1.632687
H  -1.670311 -1.724957 -1.464309
H  1.466039 -0.042682 1.917261
H  1.919624 1.615043 1.653041
H  2.848174 -1.415492 0.248893
H  3.07519 -1.549972 -1.494165
H  -2.859208 1.789754 -1.655495
H  -0.228598 3.229851 1.378415
H  -2.029794 3.634265 -0.246413
H  -2.108253 -1.300961 -3.848002
H  -0.654868 -0.410706 -3.402959
H  -2.18658 0.436137 -3.580936
H  1.472953 1.169179 4.041876
H  -0.18739 0.708905 3.689164
H  0.340517 2.36886 3.438751
H  3.070509 0.465386 -2.749982
H  1.375794 0.76609 -2.361073
H  -1.351017 -0.637658 2.360112
H  -1.1579 -2.26391 3.034154
H  2.466895 2.841008 -2.876763
H  1.951537 2.856324 -1.206946
H  4.314449 2.383744 -0.465097
H  4.24928 3.825307 -1.466396
H  4.826035 2.310109 -2.149678
elementType: Cl O N C H
totalener: -1328.99525024 hartree
nucrepener: 2020.68790314 hartree
electener: -3349.68315338 hartree
oneelecener: -5832.71874112 hartree
twoeener: 2483.03558773 hartree
cpcmener: -0.02570866 hartree
kineticenergy: 1324.25417660 hartree
xcener: -107.423584469668 hartree
chargesum: -0.0000000
charge: -0.158582 -0.370950 -0.499946 0.034891 0.157184 -0.164701 -0.168740 -0.098079 -0.158253 -0.152268 0.011317 -0.065866 -0.090051 0.302762 -0.198038 -0.268232 -0.258099 0.016630 -0.071415 -0.108941 -0.260982 0.104665 0.126702 0.090216 0.073044 0.080159 0.084308 0.100503 0.097850 0.140578 0.141106 0.154620 0.099158 0.081701 0.088508 0.096146 0.080168 0.085513 0.092939 0.082161 0.140772 0.151842 0.072332 0.058336 0.077796 0.090220 0.079016
qa: -0.1586 -0.3709 -0.4999 0.0349 0.1572 -0.1647 -0.1687 -0.0981 -0.1583 -0.1523 0.0113 -0.0659 -0.0901 0.3028 -0.1980 -0.2682 -0.2581 0.0166 -0.0714 -0.1089 -0.2610 0.1047 0.1267 0.0902 0.0730 0.0802 0.0843 0.1005 0.0979 0.1406 0.1411 0.1546 0.0992 0.0817 0.0885 0.0961 0.0802 0.0855 0.0929 0.0822 0.1408 0.1518 0.0723 0.0583 0.0778 0.0902 0.0790
va: 1.1188 1.9166 2.0091 2.9698 3.5177 3.7588 3.7204 3.7785 3.8672 3.8834 3.8865 3.7976 3.7606 4.1124 3.9761 3.9319 3.9242 3.9010 3.9666 3.9072 3.9307 1.0418 0.9923 1.0027 1.0193 1.0095 1.0091 1.0032 1.0052 0.9970 0.9970 0.9920 1.0054 1.0032 1.0034 1.0044 1.0061 1.0047 0.9980 0.9875 1.0182 1.0076 1.0127 1.0124 1.0110 1.0050 1.0024
dispcorr: -0.029565723 hartree
energy: -1329.024815962804
dipole: 20.15115 -20.05942 0.09173 19.23760 -17.50050 1.73710 -13.09188 12.09108 -1.00080
magnitude: 2.00687 au
magnitude: 5.10105 debye
