program: Orca
programVersion: 5.0.2
elementType: Cl O O N C C C C C C C C C C C C C C C C C H H H H H H H H H H H H H H H H H H H H H H H H H H
charge: 0
multiplicity: 1
keywords: wb97x-d3
keywords: def2-TZVPP
keywords: def2/J RIJCOSX
keywords: DEFGRID2
keywords: scfconv7
keywords: smallprint printgap noloewdin
keywords: NOSOSCF
formula: C17H26ClNO2
InChI: InChI=1/C17H26ClNO2/c1-4-11-21-12-10-19(16(20)13-18)17-14(5-2)8-7-9-15(17)6-3/h7-9H,4-6,10-13H2,1-3H3
47 atoms
Cl -2.504361 -1.62312 2.391148
O  2.272004 -0.043594 -1.459574
O  0.100661 -3.2889 0.989083
N  0.231143 -1.073034 0.550363
C  -0.408456 0.152549 0.189173
C  -0.84851 0.348352 -1.129828
C  -0.543508 1.155397 1.158451
C  1.682162 -1.064019 0.708241
C  -0.720872 -0.693551 -2.214801
C  -0.085844 0.999969 2.586176
C  2.469367 -1.127326 -0.590364
C  -1.422805 1.573721 -1.454925
C  -1.123687 2.364981 0.785256
C  -0.448102 -2.222103 0.762468
C  -1.558729 2.577049 -0.510135
C  -2.043635 -1.054699 -2.885098
C  1.078382 1.924419 2.937638
C  2.810302 1.187188 -1.029865
C  -1.964513 -2.150795 0.763479
C  2.559072 2.238456 -2.092153
C  3.188716 1.921624 -3.440612
H  1.961468 -0.17975 1.280033
H  1.971219 -1.921491 1.313293
H  -0.257927 -1.602194 -1.832658
H  -0.036764 -0.314491 -2.977597
H  -0.92714 1.231993 3.243863
H  0.183358 -0.032766 2.804286
H  3.530881 -1.227235 -0.321987
H  2.192333 -2.026903 -1.144195
H  -1.758726 1.750653 -2.469493
H  -1.240299 3.147249 1.526435
H  -2.005994 3.523993 -0.785093
H  -2.490781 -0.201611 -3.397035
H  -2.776072 -1.432067 -2.1694
H  -1.883997 -1.832699 -3.632779
H  0.808366 2.974252 2.816687
H  1.951998 1.738073 2.310992
H  1.380854 1.78153 3.975993
H  2.3565 1.517497 -0.086609
H  3.890394 1.085492 -0.845185
H  -2.366633 -3.145992 0.589645
H  -2.393406 -1.462149 0.041967
H  1.481119 2.38848 -2.205774
H  2.956648 3.182926 -1.711616
H  4.267913 1.776241 -3.350834
H  3.02708 2.73749 -4.146314
H  2.768797 1.019388 -3.887164
elementType: Cl O N C H
totalener: -1328.99490588 hartree
nucrepener: 2024.87107768 hartree
electener: -3353.86598356 hartree
oneelecener: -5841.06897498 hartree
twoeener: 2487.20299142 hartree
cpcmener: -0.02566352 hartree
kineticenergy: 1324.24115144 hartree
xcener: -107.422051826459 hartree
chargesum: 0.0000000
charge: -0.159159 -0.370863 -0.500091 0.034473 0.176720 -0.169715 -0.185102 -0.111157 -0.154090 -0.154964 0.016239 -0.086934 -0.059725 0.296942 -0.203036 -0.258284 -0.271176 0.018185 -0.066460 -0.108915 -0.261455 0.131873 0.105311 0.081943 0.084645 0.090355 0.073736 0.098005 0.101065 0.140830 0.140007 0.154207 0.086187 0.079193 0.096022 0.089199 0.082285 0.100312 0.078848 0.094964 0.151277 0.140603 0.059065 0.071635 0.079139 0.090254 0.077607
qa: -0.1592 -0.3709 -0.5001 0.0345 0.1767 -0.1697 -0.1851 -0.1112 -0.1541 -0.1550 0.0162 -0.0869 -0.0597 0.2969 -0.2030 -0.2583 -0.2712 0.0182 -0.0665 -0.1089 -0.2615 0.1319 0.1053 0.0819 0.0846 0.0904 0.0737 0.0980 0.1011 0.1408 0.1400 0.1542 0.0862 0.0792 0.0960 0.0892 0.0823 0.1003 0.0788 0.0950 0.1513 0.1406 0.0591 0.0716 0.0791 0.0903 0.0776
va: 1.1179 1.9176 2.0103 2.9719 3.4806 3.7226 3.7532 3.7805 3.8761 3.8656 3.8823 3.7557 3.7874 4.1195 3.9798 3.9258 3.9323 3.9049 3.9626 3.9025 3.9346 0.9900 1.0450 1.0088 1.0105 1.0023 1.0186 1.0051 1.0015 0.9971 0.9967 0.9925 1.0042 1.0061 1.0044 1.0032 1.0028 1.0055 0.9876 0.9981 1.0081 1.0193 1.0137 1.0129 1.0024 1.0050 1.0101
dispcorr: -0.029830697 hartree
energy: -1329.024736579170
dipole: 18.91911 -18.52490 0.39421 16.71371 -14.85610 1.85760 -17.65600 17.02953 -0.62647
magnitude: 1.99964 au
magnitude: 5.08268 debye
