program: Orca
programVersion: 5.0.2
elementType: Cl O O N C C C C C C C C C C C C C C C C C H H H H H H H H H H H H H H H H H H H H H H H H H H
charge: 0
multiplicity: 1
keywords: wb97x-d3
keywords: def2-TZVPP
keywords: def2/J RIJCOSX
keywords: DEFGRID2
keywords: scfconv7
keywords: smallprint printgap noloewdin
keywords: NOSOSCF
formula: C17H26ClNO2
InChI: InChI=1/C17H26ClNO2/c1-4-11-21-12-10-19(16(20)13-18)17-14(5-2)8-7-9-15(17)6-3/h7-9H,4-6,10-13H2,1-3H3
47 atoms
Cl -2.87291 -2.280708 1.492952
O  2.373566 0.277639 -1.192933
O  0.305493 -3.091805 0.896168
N  -0.095669 -1.089998 -0.070609
C  -0.719208 0.194015 -0.041872
C  -1.863837 0.403503 -0.82229
C  -0.169954 1.220412 0.740442
C  0.721987 -1.439402 -1.229633
C  -2.478323 -0.666122 -1.687626
C  1.042635 1.040054 1.618722
C  2.193683 -1.111651 -1.093801
C  -2.452668 1.664735 -0.808251
C  -0.787157 2.467964 0.71484
C  -0.266335 -2.012927 0.901428
C  -1.918108 2.692687 -0.051426
C  -2.334327 -0.372157 -3.179177
C  0.764058 1.295923 3.097461
C  3.7090 0.684157 -1.004546
C  -1.256711 -1.696763 2.007007
C  3.805558 2.187304 -1.166777
C  5.226801 2.684478 -0.951481
H  0.616925 -2.505762 -1.426623
H  0.321486 -0.917557 -2.09902
H  -3.540819 -0.741152 -1.444093
H  -2.053048 -1.643992 -1.465535
H  1.466258 0.043681 1.504863
H  1.817019 1.736022 1.286354
H  2.58812 -1.501951 -0.145793
H  2.733136 -1.631283 -1.899119
H  -3.345813 1.838513 -1.39713
H  -0.371877 3.277326 1.303773
H  -2.385347 3.669331 -0.055465
H  -2.78662 -1.16885 -3.771379
H  -1.288386 -0.291819 -3.478428
H  -2.827018 0.561214 -3.454798
H  0.010744 0.614569 3.494886
H  0.416483 2.31376 3.277549
H  1.67402 1.154553 3.68233
H  4.065287 0.389257 -0.006342
H  4.368153 0.187214 -1.732245
H  -1.36028 -0.644007 2.246783
H  -0.977291 -2.244919 2.903374
H  3.461782 2.467435 -2.166284
H  3.13333 2.673947 -0.454278
H  5.586359 2.446827 0.051466
H  5.287542 3.766393 -1.071712
H  5.921312 2.237234 -1.665164
elementType: Cl O N C H
totalener: -1328.99843079 hartree
nucrepener: 1979.13199524 hartree
electener: -3308.13042602 hartree
oneelecener: -5749.83415651 hartree
twoeener: 2441.70373049 hartree
cpcmener: -0.02675418 hartree
kineticenergy: 1324.24219347 hartree
xcener: -107.417319332396 hartree
chargesum: 0.0000000
charge: -0.158217 -0.356799 -0.503725 0.019557 0.122029 -0.126263 -0.159472 -0.021208 -0.175266 -0.171103 -0.026648 -0.079467 -0.080247 0.313122 -0.198447 -0.258955 -0.259273 0.002022 -0.083894 -0.081129 -0.277201 0.106345 0.107637 0.091745 0.073579 0.085812 0.090871 0.092376 0.101041 0.140235 0.142660 0.154249 0.094580 0.085370 0.086029 0.082745 0.086497 0.095563 0.082618 0.087811 0.142174 0.153440 0.064112 0.057594 0.080867 0.093347 0.081285
qa: -0.1582 -0.3568 -0.5037 0.0196 0.1220 -0.1263 -0.1595 -0.0212 -0.1753 -0.1711 -0.0266 -0.0795 -0.0802 0.3131 -0.1984 -0.2590 -0.2593 0.0020 -0.0839 -0.0811 -0.2772 0.1063 0.1076 0.0917 0.0736 0.0858 0.0909 0.0924 0.1010 0.1402 0.1427 0.1542 0.0946 0.0854 0.0860 0.0827 0.0865 0.0956 0.0826 0.0878 0.1422 0.1534 0.0641 0.0576 0.0809 0.0933 0.0813
va: 1.1187 1.9421 2.0048 2.9978 3.7002 3.7611 3.7514 3.7890 3.8848 3.9028 3.9521 3.8080 3.7954 4.1043 3.9788 3.9280 3.9268 3.9003 3.9748 3.8928 3.9561 1.0271 1.0206 1.0030 1.0180 1.0057 1.0031 0.9991 1.0022 0.9984 0.9964 0.9926 1.0046 1.0017 1.0042 1.0062 1.0040 1.0046 0.9894 0.9958 1.0158 1.0061 1.0122 1.0104 1.0011 1.0034 1.0020
dispcorr: -0.027320451 hartree
energy: -1329.025751238004
dipole: 24.95802 -24.20396 0.75406 19.14132 -17.36601 1.77531 -9.76593 9.49828 -0.26765
magnitude: 1.94730 au
magnitude: 4.94965 debye
