program: Gaussian 09
title: 000056213
version: EM64L-G09RevD.01
frameworkgroup: C1[X(C11H19N3O3)]
method: RPBEPBE
basis: SDD
operation: Freq
keyword: #p
keyword: freq=noraman
keyword: PBEPBE/SDD
title: #p freq=noraman PBEPBE/SDD
converged: YES YES NO NO
title: Mulliken charges:
elementType: O O O N N N C C C C C C C C C C C H H H H H H H H H H H H H H H H H H H
charge: -0.185874 -0.341290 -0.183272 -0.457999 -0.063440 -0.071199 0.062145 -0.529029 0.257304 0.113132 -0.244136 -0.480845 0.193667 -0.769902 -0.632486 -0.609045 -0.485591 0.244811 0.222216 0.208769 0.215714 0.182203 0.245840 0.405492 0.227947 0.235978 0.259860 0.280688 0.174176 0.220744 0.229255 0.180295 0.223138 0.231190 0.218644 0.220900
chargesum: 0.00000
title: Mulliken charges with hydrogens summed into heavy atoms:
elementType: O O O N N N C C C C C C C C C C C
charge: -0.185874 -0.341290 -0.183272 -0.052508 -0.063440 -0.071199 0.062145 -0.062002 0.257304 0.113132 0.180347 -0.052802 0.193667 -0.046117 0.043122 0.023643 0.185144
polarizability: 2.16953979e+02 2.19722191e+00 1.53091995e+02 6.28917707e-01 -6.18600022e+00 1.03562386e+02
1716.lowfreq: -4.4203 -0.0009 -0.0003 0.0004 3.0141 8.2202 16.3681 31.1783 37.9788
frequency: 16.2665 31.1618 37.9372 56.6593 70.9228 93.1272 108.7688 130.7679 137.9207 157.3609 169.6115 182.9316 211.0942 219.6172 230.2900 236.8586 248.7718 281.2575 282.0477 299.4302 344.7787 352.0018 356.3806 433.6206 455.6621 509.6265 567.2534 584.0290 603.3612 657.7245 700.3595 721.9302 754.3897 782.2540 811.6785 844.4932 890.3614 908.8023 928.9999 971.3700 972.4760 994.4610 1025.3394 1041.1359 1043.6995 1046.7505 1071.3141 1080.2044 1093.7119 1118.9601 1122.2925 1131.7143 1152.8502 1164.9844 1182.3699 1202.2163 1255.8619 1280.7201 1289.0200 1319.0247 1342.2998 1353.2396 1366.5195 1397.5256 1419.2758 1427.1807 1431.7542 1436.1697 1448.6623 1451.0686 1458.7958 1463.8839 1465.1067 1468.3073 1469.7414 1470.2991 1481.0247 1484.0798 1485.6326 1487.9062 1520.7323 1626.7836 1663.0913 2758.6770 2835.7106 2853.4578 2944.4836 2951.3968 2980.1210 2985.3857 2996.2356 3010.2428 3015.1409 3035.7546 3040.0540 3049.0678 3065.1241 3076.9604 3105.8054 3106.9101 3107.4475 3177.3555
redmass: 2.8439 3.4640 4.1255 3.6962 4.8826 3.0609 3.0743 1.4263 1.5640 2.6749 3.9488 3.6112 3.1672 1.4614 1.1718 1.3053 2.5945 2.6666 3.3005 2.6476 3.8205 4.7765 3.1855 2.4327 4.1577 2.7472 3.6708 4.7854 6.2547 4.6715 5.2117 5.1038 5.3174 3.2111 8.1025 4.5696 1.3641 3.0425 3.1905 2.1041 2.2415 1.7471 2.9153 1.6538 1.5330 3.1363 2.5731 2.4046 1.2580 1.6702 1.9475 1.4198 1.4308 2.2258 1.8894 1.3083 1.2936 2.0352 2.3288 2.4343 1.8307 1.7728 1.2938 1.2271 1.1505 2.3661 1.1289 1.1734 1.1865 1.1074 1.0514 1.1757 2.4865 1.1000 1.0646 1.1210 1.1319 1.1809 1.3246 1.0563 1.6445 5.9649 4.1549 1.0701 1.0581 1.0580 1.0513 1.0366 1.0680 1.0374 1.0830 1.1037 1.0709 1.1040 1.0734 1.0965 1.0984 1.1006 1.0980 1.1001 1.0996 1.0822
irintensity: 0.2496 0.9510 1.9340 0.0932 0.8352 2.5592 2.0106 0.4638 3.8986 1.1688 1.3254 1.5202 3.9184 5.7804 0.3678 0.9070 1.3014 6.6550 10.4570 12.3275 0.2018 0.6059 2.4244 0.1332 2.8715 4.3538 3.2323 3.0131 0.4196 0.8197 8.2996 8.5046 3.1846 20.4588 1.2028 23.9964 54.0228 25.8998 50.4308 3.8056 17.2668 3.1945 74.0398 18.4284 14.6976 26.7000 93.6599 5.0416 6.0400 21.9760 17.5165 17.8054 7.2887 54.3494 87.9320 25.8183 14.1556 13.9669 0.2712 97.7223 2.6403 6.8089 2.0278 9.8293 11.2210 89.5028 6.3132 11.4321 11.4355 15.2034 13.0322 24.6809 124.7447 2.5415 18.3657 11.2543 10.8921 17.4863 52.7809 34.5752 109.4135 547.7037 45.1675 162.4217 84.2579 216.4656 36.9855 118.2885 8.3707 23.7144 17.5914 75.7378 48.2017 50.2207 40.4833 16.2726 18.1023 38.6385 8.8414 23.3498 12.3416 476.2657
temp: 298.150 k
press: 1.00000 atm
elementType: 8 8 8 7 7 7 6 6 6 6 6 6 6 6 6 6 6 1 1 1 1 1 1 1 1 1 1 1 1 1 1 1 1 1 1 1
symmnumber: 1
zpe: 775690.9 jmol-1
zpe.correction: 0.295445 hartree
zpe.thermalcorrener: 0.314877 hartree
zpe.thermalcorrenthalpy: 0.315821 hartree
zpe.thermalcorrgfe: 0.245692 hartree
zpe.sumelectzpe: -819.086649 hartree
zpe.sumelectthermal: -819.067216 hartree
zpe.sumelectthermalent: -819.066272 hartree
zpe.sumelectthermalfe: -819.136402 hartree
dipole: -1.5647 9.8733 0.3910
dipole: 10.0042
quadrupole: -85.5741 -109.7785 -101.7380
quadrupole: -2.6764 5.1116 2.5189
quadrupole: 13.4561 -10.7483 -2.7078 -2.6764 5.1116 2.5189
hfenergy: -819.3820936 hartree
pointgroup: C01 [X(C11H19N3O3)]
dipole: -1.1411961 3.7155222 -0.6199545 debye
polarizability: 214.3308189|12.6977367|151.3016207|7.8038316|-13.8814854|107.9759201 unknown
InChI: InChI=1S/C11H19N3O3/c1-8-9(5-6-16-4)11(17-13-8)12-10(15)7-14(2)3/h12H,5-7H2,1-4H3
charge 0 multiplicity 1
36 atoms
O  -0.986497 -1.996887 0.750999
O  -0.906141 2.418343 -0.436984
O  1.859334 -1.748823 0.265127
N  0.241707 -0.067133 -0.045656
N  3.967163 0.216684 0.052661
N  -2.399978 -2.452891 0.764335
C  -2.225226 -0.400886 -0.335366
C  -2.619065 0.8142 -1.143007
C  -0.945286 -0.778124 0.079872
C  -3.077194 -1.471571 0.116975
C  -2.364996 2.174637 -0.467913
C  2.57888 0.591243 -0.200769
C  1.561674 -0.551485 0.03967
C  -4.564124 -1.616254 -0.063656
C  4.249836 -0.137253 1.457122
C  4.924674 1.186513 -0.505896
C  -0.555737 3.697678 0.186595
H  -2.096454 0.824677 -2.120677
H  -3.699962 0.757062 -1.370256
H  -2.843475 2.989574 -1.051762
H  -2.76384 2.187914 0.568137
H  2.242514 1.47961 0.408637
H  2.485504 0.893145 -1.263647
H  0.071764 0.944303 -0.23754
H  -5.108824 -0.770648 0.395084
H  -4.835214 -1.653352 -1.134831
H  -4.909567 -2.549005 0.410848
H  3.595836 -0.968192 1.764226
H  4.107197 0.722275 2.162409
H  5.295898 -0.480056 1.541751
H  5.951588 0.801255 -0.377275
H  4.877868 2.19769 -0.023013
H  4.744131 1.315636 -1.588812
H  0.542753 3.772186 0.153667
H  -0.900125 3.738872 1.239817
H  -0.999917 4.541461 -0.377973
