program: Orca
programVersion: 5.0.2
elementType: Cl O O N C C C C C C C C C C C C C C C C C H H H H H H H H H H H H H H H H H H H H H H H H H H
charge: 0
multiplicity: 1
keywords: wb97x-d3
keywords: def2-TZVPP
keywords: def2/J RIJCOSX
keywords: DEFGRID2
keywords: scfconv7
keywords: smallprint printgap noloewdin
keywords: NOSOSCF
formula: C17H26ClNO2
InChI: InChI=1/C17H26ClNO2/c1-4-11-21-12-10-19(16(20)13-18)17-14(5-2)8-7-9-15(17)6-3/h7-9H,4-6,10-13H2,1-3H3
47 atoms
Cl -0.964279 -2.177763 3.301358
O  2.886967 0.023507 -1.991976
O  0.637857 -2.42035 0.836145
N  -0.250267 -0.623656 -0.200792
C  -1.212619 0.429888 -0.2544
C  -2.296727 0.308361 -1.133502
C  -1.034067 1.575861 0.532783
C  0.758805 -0.655776 -1.253703
C  -2.536576 -0.920423 -1.971333
C  0.070169 1.721177 1.548893
C  2.004933 0.143134 -0.903096
C  -3.190358 1.370097 -1.232337
C  -1.949458 2.616141 0.395514
C  -0.241014 -1.58209 0.752552
C  -3.014413 2.520846 -0.483189
C  -2.358449 -0.66729 -3.465995
C  -0.452106 1.816187 2.980246
C  3.929865 0.975135 -2.003233
C  -1.441827 -1.614269 1.682367
C  4.955918 0.794749 -0.896609
C  5.599976 -0.582685 -0.886072
H  1.025536 -1.691712 -1.465111
H  0.312114 -0.245182 -2.159556
H  -3.558347 -1.26532 -1.792329
H  -1.884287 -1.737009 -1.661441
H  0.775465 0.894049 1.487744
H  0.643351 2.623598 1.320728
H  1.741397 1.19604 -0.733553
H  2.448439 -0.238335 0.025199
H  -4.037406 1.289681 -1.90368
H  -1.822763 3.514721 0.987944
H  -3.714452 3.34138 -0.576821
H  -3.052334 0.090962 -3.831269
H  -2.542083 -1.580741 -4.03319
H  -1.348014 -0.329831 -3.6998
H  -1.015725 0.927159 3.264786
H  -1.101927 2.680418 3.11938
H  0.378342 1.914279 3.680638
H  4.418645 0.869997 -2.97559
H  3.514437 1.991957 -1.959207
H  -2.165057 -2.323867 1.276473
H  -1.943721 -0.659748 1.798436
H  5.72196 1.56154 -1.044158
H  4.507757 1.007681 0.078426
H  6.373147 -0.647618 -0.119367
H  6.070773 -0.808062 -1.845385
H  4.875428 -1.372111 -0.681696
elementType: Cl O N C H
totalener: -1328.99674909 hartree
nucrepener: 1929.49627099 hartree
electener: -3258.49302007 hartree
oneelecener: -5649.87286162 hartree
twoeener: 2391.37984155 hartree
cpcmener: -0.02961723 hartree
kineticenergy: 1324.24846723 hartree
xcener: -107.419509275272 hartree
chargesum: 0.0000000
charge: -0.154733 -0.388532 -0.493730 -0.018850 0.105200 -0.105233 -0.147275 0.004353 -0.179092 -0.184949 -0.026020 -0.076600 -0.077802 0.309632 -0.192873 -0.255456 -0.264083 0.006532 -0.095798 -0.109248 -0.270115 0.102472 0.111237 0.095982 0.084207 0.080184 0.102774 0.096828 0.093055 0.140994 0.143131 0.155412 0.085101 0.094279 0.085491 0.074844 0.088558 0.097640 0.096236 0.086356 0.160661 0.144293 0.074371 0.067453 0.091629 0.079855 0.081629
qa: -0.1547 -0.3885 -0.4937 -0.0189 0.1052 -0.1052 -0.1473 0.0044 -0.1791 -0.1849 -0.0260 -0.0766 -0.0778 0.3096 -0.1929 -0.2555 -0.2641 0.0065 -0.0958 -0.1092 -0.2701 0.1025 0.1112 0.0960 0.0842 0.0802 0.1028 0.0968 0.0931 0.1410 0.1431 0.1554 0.0851 0.0943 0.0855 0.0748 0.0886 0.0976 0.0962 0.0864 0.1607 0.1443 0.0744 0.0675 0.0916 0.0799 0.0816
va: 1.1198 1.9290 2.0233 2.9925 3.6920 3.8187 3.7916 3.7351 3.8862 3.8882 3.9377 3.7980 3.8063 4.1319 3.9729 3.9146 3.9278 3.9257 4.0083 3.8274 3.9393 1.0286 1.0150 1.0006 1.0125 1.0129 0.9966 0.9884 0.9919 0.9988 0.9969 0.9923 1.0041 1.0051 1.0023 1.0122 1.0059 1.0039 0.9944 1.0015 1.0010 0.9939 1.0131 1.0040 1.0044 1.0013 1.0053
dispcorr: -0.025687007 hartree
energy: -1329.022436092039
dipole: 14.72738 -15.93071 -1.20333 14.25298 -11.91613 2.33685 -17.28440 16.29278 -0.99162
magnitude: 2.80930 au
magnitude: 7.14067 debye
