program: Orca
programVersion: 5.0.2
elementType: Cl O O N C C C C C C C C C C C C C C C C C H H H H H H H H H H H H H H H H H H H H H H H H H H
charge: 0
multiplicity: 1
keywords: wb97x-d3
keywords: def2-TZVPP
keywords: def2/J RIJCOSX
keywords: DEFGRID2
keywords: scfconv7
keywords: smallprint printgap noloewdin
keywords: NOSOSCF
formula: C17H26ClNO2
InChI: InChI=1/C17H26ClNO2/c1-4-11-21-12-10-19(16(20)13-18)17-14(5-2)8-7-9-15(17)6-3/h7-9H,4-6,10-13H2,1-3H3
47 atoms
Cl -1.193657 -1.759336 3.133701
O  3.210868 0.122883 -1.265063
O  0.428564 -2.448212 0.636799
N  -0.26146 -0.495148 -0.254796
C  -1.211957 0.566093 -0.365113
C  -2.111444 0.535038 -1.439387
C  -1.198027 1.62823 0.548108
C  0.923102 -0.426466 -1.105449
C  -2.179109 -0.615414 -2.408578
C  -0.253752 1.695625 1.722182
C  2.117515 0.182699 -0.386593
C  -3.004731 1.589725 -1.588537
C  -2.110197 2.664927 0.357702
C  -0.403073 -1.559509 0.566353
C  -3.004797 2.64998 -0.697555
C  -3.240756 -1.640815 -2.018484
C  -0.955446 1.943513 3.053686
C  4.403306 0.612299 -0.692751
C  -1.661938 -1.640032 1.410535
C  5.546123 0.44341 -1.671874
C  5.833778 -1.006776 -2.032722
H  1.175482 -1.426791 -1.458664
H  0.676483 0.175339 -1.980245
H  -1.216096 -1.116889 -2.504456
H  -2.415093 -0.222643 -3.399813
H  0.333053 0.781979 1.800978
H  0.469595 2.496988 1.546746
H  1.900308 1.221318 -0.103231
H  2.328142 -0.369777 0.538812
H  -3.705899 1.577613 -2.415044
H  -2.115305 3.502591 1.044437
H  -3.701929 3.468131 -0.827642
H  -3.284294 -2.446357 -2.752526
H  -4.23109 -1.186539 -1.964349
H  -3.029965 -2.091228 -1.047772
H  -0.233507 1.907843 3.870364
H  -1.71579 1.188692 3.252504
H  -1.436643 2.920653 3.090782
H  4.291695 1.672006 -0.424374
H  4.62818 0.071822 0.238271
H  -2.193226 -2.556121 1.153969
H  -2.343822 -0.802238 1.308677
H  5.341641 1.02392 -2.575984
H  6.431464 0.892537 -1.215334
H  4.998691 -1.470393 -2.559007
H  6.035746 -1.604023 -1.140873
H  6.707626 -1.0827 -2.681076
elementType: Cl O N C H
totalener: -1328.99811965 hartree
nucrepener: 1923.51625235 hartree
electener: -3252.51437201 hartree
oneelecener: -5638.11237436 hartree
twoeener: 2385.59800235 hartree
cpcmener: -0.02818792 hartree
kineticenergy: 1324.24390748 hartree
xcener: -107.417054316602 hartree
chargesum: -0.0000000
charge: -0.156637 -0.374658 -0.499494 -0.008895 0.086836 -0.118134 -0.100208 -0.000053 -0.145823 -0.184179 -0.007578 -0.083110 -0.090188 0.300855 -0.180890 -0.271012 -0.278417 0.013294 -0.094779 -0.101134 -0.254660 0.099254 0.110810 0.083792 0.087735 0.074865 0.101459 0.089919 0.085943 0.140436 0.142840 0.155710 0.097678 0.088235 0.085479 0.097802 0.076760 0.092004 0.087529 0.080617 0.159132 0.145326 0.059031 0.062244 0.077948 0.076274 0.090040
qa: -0.1566 -0.3747 -0.4995 -0.0089 0.0868 -0.1181 -0.1002 -0.0001 -0.1458 -0.1842 -0.0076 -0.0831 -0.0902 0.3009 -0.1809 -0.2710 -0.2784 0.0133 -0.0948 -0.1011 -0.2547 0.0993 0.1108 0.0838 0.0877 0.0749 0.1015 0.0899 0.0859 0.1404 0.1428 0.1557 0.0977 0.0882 0.0855 0.0978 0.0768 0.0920 0.0875 0.0806 0.1591 0.1453 0.0590 0.0622 0.0779 0.0763 0.0900
va: 1.1179 1.9555 2.0191 2.9807 3.7212 3.8953 3.7640 3.7504 3.9050 3.8773 3.9341 3.8173 3.8180 4.1193 3.9615 3.9131 3.9303 3.8985 3.9912 3.9267 3.9168 1.0283 1.0058 1.0077 1.0022 1.0171 0.9971 0.9861 1.0032 0.9994 0.9983 0.9920 1.0052 1.0023 1.0046 1.0029 1.0141 1.0063 0.9961 0.9898 1.0036 1.0009 1.0143 1.0120 1.0131 1.0034 1.0046
dispcorr: -0.025502001 hartree
energy: -1329.023621654848
dipole: 14.80775 -15.85425 -1.04650 9.06692 -7.06725 1.99967 -15.10852 14.26916 -0.83936
magnitude: 2.40798 au
magnitude: 6.12060 debye
