program: Orca
programVersion: 5.0.2
elementType: Cl O O N C C C C C C C C C C C C C C C C C H H H H H H H H H H H H H H H H H H H H H H H H H H
charge: 0
multiplicity: 1
keywords: wb97x-d3
keywords: def2-TZVPP
keywords: def2/J RIJCOSX
keywords: DEFGRID2
keywords: scfconv7
keywords: smallprint printgap noloewdin
keywords: NOSOSCF
formula: C17H26ClNO2
InChI: InChI=1/C17H26ClNO2/c1-4-11-21-12-10-19(16(20)13-18)17-14(5-2)8-7-9-15(17)6-3/h7-9H,4-6,10-13H2,1-3H3
47 atoms
Cl -2.145002 -3.195931 2.066423
O  2.568533 -0.429762 -1.256226
O  0.547135 -2.145078 1.983131
N  0.203604 -0.262288 0.788969
C  -0.722349 0.685216 0.250457
C  -1.171492 0.533859 -1.073242
C  -1.152749 1.744884 1.0550
C  1.603658 0.13797 0.950543
C  -0.737777 -0.649292 -1.902517
C  -0.711117 1.928587 2.483814
C  2.625207 -0.637832 0.131436
C  -2.050803 1.486648 -1.575302
C  -2.03558 2.675141 0.509439
C  -0.219402 -1.373931 1.43795
C  -2.476276 2.551328 -0.793752
C  -1.19344 -0.64442 -3.352443
C  0.239021 3.109565 2.664904
C  3.052126 0.821724 -1.695113
C  -1.728281 -1.565707 1.496102
C  3.105451 0.833884 -3.208791
C  4.018642 -0.228498 -3.801161
H  1.664853 1.200549 0.718221
H  1.886411 0.038753 2.001989
H  -1.100167 -1.568676 -1.43082
H  0.348828 -0.725859 -1.870971
H  -1.599049 2.095684 3.098906
H  -0.242109 1.024971 2.873753
H  3.61648 -0.364482 0.520148
H  2.504712 -1.709216 0.292703
H  -2.418337 1.404111 -2.589207
H  -2.385446 3.497883 1.122278
H  -3.1636 3.279716 -1.20524
H  -0.834914 0.23244 -3.894154
H  -2.279703 -0.676769 -3.448078
H  -0.799409 -1.524185 -3.861881
H  0.519606 3.217134 3.713476
H  -0.222814 4.046223 2.349947
H  1.1557 2.981529 2.088429
H  2.411113 1.641602 -1.346428
H  4.055393 1.00261 -1.282193
H  -2.214582 -1.41726 0.535266
H  -2.154973 -0.845576 2.196526
H  2.093085 0.72648 -3.61027
H  3.448657 1.826507 -3.511593
H  3.668405 -1.23723 -3.581703
H  5.035773 -0.138339 -3.413673
H  4.072978 -0.13374 -4.886337
elementType: Cl O N C H
totalener: -1328.99745450 hartree
nucrepener: 1955.06892157 hartree
electener: -3284.06637606 hartree
oneelecener: -5701.18931750 hartree
twoeener: 2417.12294144 hartree
cpcmener: -0.02826944 hartree
kineticenergy: 1324.23768515 hartree
xcener: -107.419528316044 hartree
chargesum: 0.0000000
charge: -0.154579 -0.380890 -0.487004 0.009627 0.089100 -0.165118 -0.132679 -0.085415 -0.106328 -0.159576 0.013971 -0.080948 -0.078000 0.296874 -0.201443 -0.299188 -0.265121 0.018768 -0.088093 -0.105930 -0.259408 0.116169 0.110676 0.087175 0.083329 0.097812 0.082745 0.094655 0.103312 0.144740 0.141596 0.155115 0.087845 0.093082 0.099628 0.095952 0.086733 0.085914 0.088849 0.089692 0.148924 0.151308 0.059438 0.070630 0.078593 0.077160 0.090306
qa: -0.1546 -0.3809 -0.4870 0.0096 0.0891 -0.1651 -0.1327 -0.0854 -0.1063 -0.1596 0.0140 -0.0809 -0.0780 0.2969 -0.2014 -0.2992 -0.2651 0.0188 -0.0881 -0.1059 -0.2594 0.1162 0.1107 0.0872 0.0833 0.0978 0.0827 0.0947 0.1033 0.1447 0.1416 0.1551 0.0878 0.0931 0.0996 0.0960 0.0867 0.0859 0.0888 0.0897 0.1489 0.1513 0.0594 0.0706 0.0786 0.0772 0.0903
va: 1.1205 1.9106 2.0236 2.9747 3.6911 3.8342 3.7984 3.7855 3.8864 3.8708 3.8882 3.7750 3.8205 4.1292 4.0092 3.9506 3.9190 3.8749 4.0082 3.9203 3.9242 0.9868 1.0226 0.9977 1.0360 0.9989 1.0120 1.0028 1.0184 0.9979 0.9978 0.9933 0.9979 0.9974 1.0035 1.0046 1.0035 1.0001 0.9899 0.9956 1.0016 1.0039 1.0081 1.0125 1.0125 1.0024 1.0051
dispcorr: -0.026425501 hartree
energy: -1329.023879999574
dipole: 18.99728 -19.11394 -0.11666 21.25090 -18.30048 2.95042 -20.05761 19.32083 -0.73678
magnitude: 3.04326 au
magnitude: 7.73536 debye
