program: Orca
programVersion: 5.0.2
elementType: Cl O O N C C C C C C C C C C C C C C C C C H H H H H H H H H H H H H H H H H H H H H H H H H H
charge: 0
multiplicity: 1
keywords: wb97x-d3
keywords: def2-TZVPP
keywords: def2/J RIJCOSX
keywords: DEFGRID2
keywords: scfconv7
keywords: smallprint printgap noloewdin
keywords: NOSOSCF
formula: C17H26ClNO2
InChI: InChI=1/C17H26ClNO2/c1-4-11-21-12-10-19(16(20)13-18)17-14(5-2)8-7-9-15(17)6-3/h7-9H,4-6,10-13H2,1-3H3
47 atoms
Cl -3.177997 -2.813056 1.795362
O  2.330199 0.12372 -1.281257
O  -0.378924 -3.167954 1.198897
N  0.162007 -1.100622 0.483749
C  -0.259683 0.222567 0.151635
C  -0.694542 0.489996 -1.153016
C  -0.219886 1.223894 1.130875
C  1.547336 -1.533997 0.268995
C  -0.740979 -0.562975 -2.228981
C  0.236397 0.956728 2.544113
C  2.519479 -0.409668 0.004268
C  -1.09382 1.785014 -1.463942
C  -0.641183 2.504707 0.779344
C  -0.706362 -2.020086 0.960923
C  -1.070241 2.785477 -0.506055
C  -2.153475 -0.835853 -2.736949
C  1.289916 1.937387 3.049295
C  2.881758 1.41085 -1.435707
C  -2.123997 -1.515213 1.194973
C  2.633504 1.908726 -2.844211
C  3.211194 3.301199 -3.047702
H  1.892348 -2.053387 1.164846
H  1.589776 -2.255678 -0.552421
H  -0.301539 -1.496156 -1.881425
H  -0.121976 -0.232122 -3.066332
H  -0.633339 0.999836 3.207302
H  0.626625 -0.057002 2.631954
H  2.428114 0.36456 0.776461
H  3.531798 -0.824377 0.105172
H  -1.421888 2.014248 -2.471132
H  -0.634615 3.29408 1.521042
H  -1.386895 3.788412 -0.763379
H  -2.608008 0.053714 -3.172569
H  -2.809357 -1.184842 -1.939177
H  -2.139204 -1.606047 -3.509074
H  1.614587 1.659399 4.052611
H  0.913936 2.95904 3.10411
H  2.171693 1.943225 2.406775
H  2.433817 2.105398 -0.709333
H  3.962849 1.396876 -1.232015
H  -2.561817 -1.129386 0.275986
H  -2.134301 -0.710485 1.929548
H  3.078099 1.213657 -3.561671
H  1.557624 1.924173 -3.040644
H  2.760543 4.024499 -2.365545
H  3.034153 3.656364 -4.063099
H  4.289557 3.317024 -2.87931
elementType: Cl O N C H
totalener: -1328.99603618 hartree
nucrepener: 1988.89220291 hartree
electener: -3317.88823908 hartree
oneelecener: -5768.73363150 hartree
twoeener: 2450.84539242 hartree
cpcmener: -0.02968955 hartree
kineticenergy: 1324.24669405 hartree
xcener: -107.422848765271 hartree
chargesum: 0.0000000
charge: -0.153572 -0.357817 -0.489038 -0.013279 0.184436 -0.175586 -0.163404 -0.050395 -0.164966 -0.174611 -0.018399 -0.097861 -0.084995 0.315091 -0.178141 -0.262789 -0.263999 0.020749 -0.093106 -0.085914 -0.278789 0.108068 0.107535 0.081813 0.084766 0.096652 0.089028 0.089857 0.107918 0.139955 0.139623 0.154560 0.084856 0.086956 0.096643 0.095670 0.088873 0.085317 0.068193 0.093846 0.152542 0.150089 0.068102 0.057707 0.081409 0.094199 0.082209
qa: -0.1536 -0.3578 -0.4890 -0.0133 0.1844 -0.1756 -0.1634 -0.0504 -0.1650 -0.1746 -0.0184 -0.0979 -0.0850 0.3151 -0.1781 -0.2628 -0.2640 0.0207 -0.0931 -0.0859 -0.2788 0.1081 0.1075 0.0818 0.0848 0.0967 0.0890 0.0899 0.1079 0.1400 0.1396 0.1546 0.0849 0.0870 0.0966 0.0957 0.0889 0.0853 0.0682 0.0938 0.1525 0.1501 0.0681 0.0577 0.0814 0.0942 0.0822
va: 1.1241 1.9464 2.0304 2.9680 3.4191 3.7852 3.8030 3.8187 3.8807 3.8688 4.0102 3.7371 3.7917 4.1080 3.9527 3.9353 3.9301 3.8959 3.9966 3.8890 3.9601 1.0138 1.0095 1.0110 1.0061 0.9985 1.0096 0.9845 1.0033 0.9978 0.9991 0.9916 1.0040 0.9968 1.0043 1.0051 1.0026 1.0007 0.9863 0.9965 0.9903 1.0091 1.0124 1.0109 1.0008 1.0031 1.0026
dispcorr: -0.028490880 hartree
energy: -1329.024527057015
dipole: 22.57521 -21.50328 1.07193 25.50109 -22.53438 2.96671 -14.90009 14.40211 -0.49798
magnitude: 3.19349 au
magnitude: 8.11721 debye
