program: Orca
programVersion: 5.0.2
elementType: Cl O O N C C C C C C C C C C C C C C C C C H H H H H H H H H H H H H H H H H H H H H H H H H H
charge: 0
multiplicity: 1
keywords: wb97x-d3
keywords: def2-TZVPP
keywords: def2/J RIJCOSX
keywords: DEFGRID2
keywords: scfconv7
keywords: smallprint printgap noloewdin
keywords: NOSOSCF
formula: C17H26ClNO2
InChI: InChI=1/C17H26ClNO2/c1-4-11-21-12-10-19(16(20)13-18)17-14(5-2)8-7-9-15(17)6-3/h7-9H,4-6,10-13H2,1-3H3
47 atoms
Cl -1.440063 -3.106719 2.531922
O  2.858548 0.67883 -1.394892
O  0.422333 -2.434648 0.428143
N  -0.36461 -0.412967 -0.179572
C  -1.39377 0.573276 -0.097971
C  -2.525641 0.445988 -0.913795
C  -1.246342 1.655132 0.778476
C  0.690363 -0.24595 -1.175471
C  -2.699401 -0.684251 -1.891744
C  -0.033378 1.835405 1.647932
C  2.102454 -0.195808 -0.588156
C  -3.513592 1.422955 -0.833241
C  -2.257238 2.610819 0.826801
C  -0.402573 -1.549035 0.550869
C  -3.382829 2.498851 0.028517
C  -2.318402 -0.278039 -3.313531
C  0.972247 2.811454 1.041423
C  4.147623 0.959341 -0.894376
C  -1.554816 -1.63657 1.542498
C  5.173963 -0.131647 -1.158027
C  6.543565 0.274866 -0.634495
H  0.615331 -1.030532 -1.932953
H  0.493839 0.701324 -1.675771
H  -3.745036 -0.999526 -1.881377
H  -2.116197 -1.557151 -1.596742
H  -0.351462 2.214057 2.621846
H  0.452945 0.87819 1.837567
H  2.068615 0.170112 0.446405
H  2.54831 -1.194443 -0.561512
H  -4.398533 1.331656 -1.452426
H  -2.159318 3.448754 1.507278
H  -4.163116 3.247494 0.083372
H  -2.446743 -1.115075 -4.001041
H  -1.279184 0.046474 -3.375126
H  -2.942432 0.542715 -3.67036
H  0.540699 3.80834 0.940874
H  1.299683 2.49487 0.051037
H  1.857256 2.895599 1.673691
H  4.469741 1.882947 -1.383842
H  4.100137 1.171496 0.183997
H  -2.512302 -1.656131 1.021989
H  -1.560845 -0.779712 2.21504
H  4.867483 -1.068837 -0.685565
H  5.227742 -0.321587 -2.233487
H  6.526589 0.435545 0.445288
H  6.890697 1.200078 -1.098995
H  7.290121 -0.493138 -0.837902
elementType: Cl O N C H
totalener: -1328.99639914 hartree
nucrepener: 1917.20326069 hartree
electener: -3246.19965982 hartree
oneelecener: -5625.29674409 hartree
twoeener: 2379.09708427 hartree
cpcmener: -0.02816025 hartree
kineticenergy: 1324.24907706 hartree
xcener: -107.417101656164 hartree
chargesum: 0.0000000
charge: -0.151451 -0.391738 -0.486827 -0.009111 0.125463 -0.165539 -0.117155 -0.051626 -0.158234 -0.183935 -0.033482 -0.067135 -0.069011 0.273707 -0.190179 -0.270517 -0.284976 0.030878 -0.072405 -0.080990 -0.276333 0.122002 0.105705 0.090781 0.087343 0.094473 0.090920 0.105465 0.110059 0.141147 0.141148 0.155403 0.095991 0.089846 0.088127 0.097654 0.084933 0.100661 0.095744 0.065664 0.148664 0.145750 0.060911 0.057717 0.081730 0.080384 0.092371
qa: -0.1515 -0.3917 -0.4868 -0.0091 0.1255 -0.1655 -0.1172 -0.0516 -0.1582 -0.1839 -0.0335 -0.0671 -0.0690 0.2737 -0.1902 -0.2705 -0.2850 0.0309 -0.0724 -0.0810 -0.2763 0.1220 0.1057 0.0908 0.0873 0.0945 0.0909 0.1055 0.1101 0.1411 0.1411 0.1554 0.0960 0.0898 0.0881 0.0977 0.0849 0.1007 0.0957 0.0657 0.1487 0.1458 0.0609 0.0577 0.0817 0.0804 0.0924
va: 1.1266 1.9107 2.0259 2.9235 3.5498 3.8279 3.8008 3.7580 3.8715 3.8743 3.8963 3.8007 3.8009 4.1568 3.9668 3.9151 3.8962 3.9151 3.9969 3.8627 3.9541 1.0025 1.0134 1.0017 1.0099 1.0025 1.0080 0.9824 1.0164 0.9977 0.9980 0.9916 1.0041 0.9993 1.0030 1.0066 1.0120 1.0050 0.9970 0.9965 1.0039 1.0045 1.0123 1.0135 1.0012 1.0018 1.0029
dispcorr: -0.025759881 hartree
energy: -1329.022159015658
dipole: 22.39106 -23.11450 -0.72344 19.62120 -17.44396 2.17724 -15.74283 15.45500 -0.28783
magnitude: 2.31227 au
magnitude: 5.87732 debye
