program: Orca
programVersion: 5.0.2
elementType: Cl O O N C C C C C C C C C C C C C C C C C H H H H H H H H H H H H H H H H H H H H H H H H H H
charge: 0
multiplicity: 1
keywords: wb97x-d3
keywords: def2-TZVPP
keywords: def2/J RIJCOSX
keywords: DEFGRID2
keywords: scfconv7
keywords: smallprint printgap noloewdin
keywords: NOSOSCF
formula: C17H26ClNO2
InChI: InChI=1/C17H26ClNO2/c1-4-11-21-12-10-19(16(20)13-18)17-14(5-2)8-7-9-15(17)6-3/h7-9H,4-6,10-13H2,1-3H3
47 atoms
Cl -1.511699 -2.849586 2.783824
O  2.488797 0.716168 -0.884299
O  0.326666 -2.683277 0.570351
N  -0.178872 -0.639048 -0.239687
C  -1.028394 0.509821 -0.222583
C  -2.177578 0.506066 -1.027611
C  -0.697793 1.618125 0.570181
C  0.727907 -0.825529 -1.372145
C  -2.586629 -0.674865 -1.869846
C  0.490282 1.64206 1.49906
C  2.20076 -0.649175 -1.062695
C  -2.978841 1.64269 -1.047971
C  -1.52235 2.73945 0.50666
C  -0.340282 -1.667581 0.626245
C  -2.649732 2.75727 -0.295785
C  -2.359187 -0.449692 -3.362275
C  0.125205 1.986754 2.940071
C  3.724629 0.968596 -0.250826
C  -1.435204 -1.472644 1.664907
C  4.944199 0.587073 -1.075477
C  4.994298 1.269639 -2.433263
H  0.580836 -1.823674 -1.789284
H  0.439035 -0.116946 -2.148188
H  -3.650006 -0.863847 -1.702369
H  -2.068211 -1.581812 -1.558047
H  1.005176 0.683392 1.484651
H  1.210598 2.37814 1.132463
H  2.481568 -1.232315 -0.177202
H  2.763435 -1.067052 -1.908127
H  -3.874921 1.649571 -1.657878
H  -1.278357 3.614171 1.097293
H  -3.278355 3.638181 -0.326807
H  -1.306738 -0.278765 -3.589922
H  -2.920489 0.412152 -3.725936
H  -2.684156 -1.319818 -3.934283
H  -0.60024 1.283808 3.352805
H  -0.296637 2.987801 3.032717
H  1.013452 1.950406 3.572176
H  3.74365 2.042967 -0.048933
H  3.764658 0.456604 0.721042
H  -2.407486 -1.377266 1.1807
H  -1.270525 -0.573364 2.255318
H  5.825187 0.862599 -0.48875
H  4.99833 -0.498423 -1.198239
H  4.981224 2.356841 -2.331358
H  4.149604 0.989174 -3.063998
H  5.903743 1.003382 -2.973321
elementType: Cl O N C H
totalener: -1328.99797662 hartree
nucrepener: 1946.50668499 hartree
electener: -3275.50466161 hartree
oneelecener: -5684.33389700 hartree
twoeener: 2408.82923539 hartree
cpcmener: -0.02834660 hartree
kineticenergy: 1324.23393027 hartree
xcener: -107.417137640216 hartree
chargesum: 0.0000000
charge: -0.151987 -0.377361 -0.488919 -0.003817 0.111339 -0.151554 -0.127990 -0.028787 -0.156933 -0.179497 -0.020628 -0.074147 -0.087052 0.297673 -0.192377 -0.265053 -0.255278 0.005814 -0.076296 -0.107523 -0.267878 0.111243 0.105599 0.096316 0.083767 0.078701 0.090995 0.097439 0.092646 0.140570 0.142827 0.154773 0.087252 0.086207 0.095263 0.083985 0.087089 0.094547 0.094004 0.088088 0.147111 0.148085 0.074188 0.066680 0.080034 0.078397 0.092444
qa: -0.1520 -0.3774 -0.4889 -0.0038 0.1113 -0.1516 -0.1280 -0.0288 -0.1569 -0.1795 -0.0206 -0.0741 -0.0871 0.2977 -0.1924 -0.2651 -0.2553 0.0058 -0.0763 -0.1075 -0.2679 0.1112 0.1056 0.0963 0.0838 0.0787 0.0910 0.0974 0.0926 0.1406 0.1428 0.1548 0.0873 0.0862 0.0953 0.0840 0.0871 0.0945 0.0940 0.0881 0.1471 0.1481 0.0742 0.0667 0.0800 0.0784 0.0924
va: 1.1278 1.9037 2.0201 2.9881 3.6660 3.8200 3.7934 3.8061 3.8723 3.9110 3.9507 3.8123 3.8013 4.1274 3.9705 3.9178 3.9219 3.9051 4.0112 3.8830 3.9354 1.0179 1.0155 0.9989 1.0122 1.0069 1.0023 1.0037 0.9919 0.9983 0.9980 0.9927 1.0005 1.0033 1.0045 0.9995 1.0040 1.0049 0.9903 0.9988 1.0062 0.9992 1.0126 1.0034 1.0011 1.0058 1.0049
dispcorr: -0.026309849 hartree
energy: -1329.024286469099
dipole: 18.26794 -18.45973 -0.19179 18.38854 -16.45168 1.93686 -17.67865 16.77249 -0.90616
magnitude: 2.14694 au
magnitude: 5.45708 debye
