program: Orca
programVersion: 5.0.2
elementType: Cl O O N C C C C C C C C C C C C C C C C C H H H H H H H H H H H H H H H H H H H H H H H H H H
charge: 0
multiplicity: 1
keywords: wb97x-d3
keywords: def2-TZVPP
keywords: def2/J RIJCOSX
keywords: DEFGRID2
keywords: scfconv7
keywords: smallprint printgap noloewdin
keywords: NOSOSCF
formula: C17H26ClNO2
InChI: InChI=1/C17H26ClNO2/c1-4-11-21-12-10-19(16(20)13-18)17-14(5-2)8-7-9-15(17)6-3/h7-9H,4-6,10-13H2,1-3H3
47 atoms
Cl -0.797125 -2.678237 2.903289
O  2.266567 -0.238348 -1.368197
O  1.228129 -0.787534 2.114638
N  0.104632 0.386822 0.543868
C  -1.179887 0.829907 0.093438
C  -1.742326 0.291183 -1.069549
C  -1.853881 1.806987 0.842107
C  1.257326 1.239468 0.241077
C  -1.060489 -0.75117 -1.913677
C  -1.279311 2.430864 2.087666
C  2.520173 0.546469 -0.233704
C  -2.998201 0.743959 -1.467365
C  -3.105331 2.23078 0.407529
C  0.199069 -0.558232 1.509667
C  -3.677016 1.704237 -0.738625
C  -0.577805 -0.187659 -3.247118
C  -0.747303 3.840272 1.839326
C  3.400276 -0.952381 -1.802071
C  -1.088004 -1.323468 1.791035
C  3.053335 -1.782544 -3.020256
C  4.253021 -2.583966 -3.501613
H  0.927173 1.937681 -0.52763
H  1.527484 1.838052 1.116984
H  -1.769423 -1.56021 -2.107805
H  -0.223347 -1.197747 -1.380184
H  -2.064735 2.479291 2.84573
H  -0.486944 1.817188 2.516861
H  3.239175 1.347517 -0.462929
H  2.968988 -0.053453 0.563452
H  -3.452768 0.325838 -2.358109
H  -3.642315 2.975204 0.983936
H  -4.656973 2.035203 -1.058316
H  -1.405869 0.21322 -3.83399
H  -0.102295 -0.966673 -3.84504
H  0.1472 0.614679 -3.108575
H  -0.330865 4.26067 2.755893
H  -1.5382 4.510136 1.498714
H  0.039037 3.84767 1.083711
H  4.220804 -0.261748 -2.046926
H  3.770106 -1.606168 -0.998452
H  -1.518981 -1.727946 0.876347
H  -1.831882 -0.671778 2.249498
H  2.230839 -2.460691 -2.776775
H  2.700173 -1.127429 -3.821221
H  5.085659 -1.933784 -3.776308
H  4.002212 -3.181195 -4.378369
H  4.610745 -3.268634 -2.730456
elementType: Cl O N C H
totalener: -1328.99787594 hartree
nucrepener: 1943.11615813 hartree
electener: -3272.11403407 hartree
oneelecener: -5677.88354188 hartree
twoeener: 2405.76950781 hartree
cpcmener: -0.02677685 hartree
kineticenergy: 1324.24310214 hartree
xcener: -107.416341288202 hartree
chargesum: -0.0000000
charge: -0.153363 -0.361553 -0.484608 -0.015434 0.132212 -0.078618 -0.176738 -0.082592 -0.159707 -0.157497 0.001703 -0.077393 -0.068627 0.283382 -0.197010 -0.294960 -0.271807 0.042348 -0.081084 -0.088185 -0.275589 0.118480 0.107919 0.096229 0.072117 0.092499 0.086583 0.095996 0.093265 0.139477 0.142029 0.154563 0.098495 0.095496 0.083135 0.096686 0.088264 0.089427 0.070069 0.072072 0.144523 0.150496 0.063139 0.059071 0.080872 0.092939 0.081274
qa: -0.1534 -0.3616 -0.4846 -0.0154 0.1322 -0.0786 -0.1767 -0.0826 -0.1597 -0.1575 0.0017 -0.0774 -0.0686 0.2834 -0.1970 -0.2950 -0.2718 0.0423 -0.0811 -0.0882 -0.2756 0.1185 0.1079 0.0962 0.0721 0.0925 0.0866 0.0960 0.0933 0.1395 0.1420 0.1546 0.0985 0.0955 0.0831 0.0967 0.0883 0.0894 0.0701 0.0721 0.1445 0.1505 0.0631 0.0591 0.0809 0.0929 0.0813
va: 1.1255 1.9481 2.0273 2.9561 3.5332 3.7614 3.8189 3.8881 3.8068 3.8598 3.9228 3.7967 3.8089 4.1474 3.9729 3.9164 3.9134 3.8904 4.0048 3.8925 3.9653 0.9953 1.0063 1.0015 1.0471 1.0027 1.0145 0.9970 1.0130 0.9984 0.9968 0.9923 1.0092 1.0011 1.0152 1.0032 1.0038 0.9995 0.9902 0.9934 1.0064 1.0022 1.0073 1.0071 1.0016 1.0031 1.0016
dispcorr: -0.026113367 hartree
energy: -1329.023989308781
dipole: 13.82718 -14.61198 -0.78480 11.80222 -10.17423 1.62799 -25.29533 23.82709 -1.46824
magnitude: 2.32852 au
magnitude: 5.91862 debye
