program: Orca
programVersion: 5.0.2
elementType: Cl O O N C C C C C C C C C C C C C C C C C H H H H H H H H H H H H H H H H H H H H H H H H H H
charge: 0
multiplicity: 1
keywords: wb97x-d3
keywords: def2-TZVPP
keywords: def2/J RIJCOSX
keywords: DEFGRID2
keywords: scfconv7
keywords: smallprint printgap noloewdin
keywords: NOSOSCF
formula: C17H26ClNO2
InChI: InChI=1/C17H26ClNO2/c1-4-11-21-12-10-19(16(20)13-18)17-14(5-2)8-7-9-15(17)6-3/h7-9H,4-6,10-13H2,1-3H3
47 atoms
Cl -0.372633 -2.356754 2.673481
O  2.605624 -0.093436 -0.98856
O  0.600346 -2.562686 -0.115375
N  -0.301787 -0.597729 -0.779583
C  -1.166091 0.5184 -0.559072
C  -2.376264 0.576438 -1.264074
C  -0.764967 1.562697 0.285669
C  0.490464 -0.560244 -2.006837
C  -2.887569 -0.561285 -2.108322
C  0.490117 1.521638 1.118588
C  1.685336 0.36452 -1.943341
C  -3.163077 1.716878 -1.140457
C  -1.5872 2.683091 0.382843
C  -0.186954 -1.651425 0.061068
C  -2.769686 2.768787 -0.330336
C  -4.007028 -1.329035 -1.408933
C  0.207797 1.548699 2.618536
C  3.66767 0.809875 -0.779988
C  -1.167505 -1.699528 1.22056
C  4.54564 0.321966 0.352667
C  5.70029 1.280174 0.603335
H  0.804321 -1.571738 -2.257775
H  -0.149049 -0.213863 -2.820115
H  -2.091493 -1.257449 -2.368986
H  -3.266488 -0.160511 -3.051215
H  1.085714 0.64235 0.885805
H  1.110615 2.384433 0.862168
H  2.135978 0.398026 -2.945755
H  1.358007 1.388602 -1.714931
H  -4.09564 1.778569 -1.68922
H  -1.286127 3.505288 1.021342
H  -3.386763 3.654932 -0.252554
H  -3.663597 -1.766986 -0.470973
H  -4.369221 -2.141101 -2.040699
H  -4.85572 -0.682649 -1.181533
H  -0.407191 0.704486 2.93063
H  -0.304591 2.46227 2.920665
H  1.142615 1.497844 3.178348
H  4.264051 0.918295 -1.698084
H  3.276365 1.809762 -0.540761
H  -1.977537 -2.378627 0.952017
H  -1.605081 -0.742578 1.485531
H  3.944755 0.220787 1.260861
H  4.933331 -0.672505 0.116111
H  6.322688 0.940507 1.431111
H  5.342183 2.280742 0.853177
H  6.343565 1.370622 -0.273977
elementType: Cl O N C H
totalener: -1328.99872993 hartree
nucrepener: 1968.60744009 hartree
electener: -3297.60617002 hartree
oneelecener: -5728.76521005 hartree
twoeener: 2431.15904003 hartree
cpcmener: -0.03325885 hartree
kineticenergy: 1324.25672605 hartree
xcener: -107.421632795687 hartree
chargesum: -0.0000000
charge: -0.158570 -0.362831 -0.492799 0.000540 0.118424 -0.106272 -0.155425 -0.045094 -0.155794 -0.159048 -0.017244 -0.086064 -0.079549 0.313414 -0.196079 -0.269254 -0.273813 -0.000624 -0.113448 -0.069380 -0.278733 0.103330 0.113502 0.077828 0.092380 0.073713 0.096633 0.109302 0.092393 0.140997 0.145173 0.155381 0.084695 0.095727 0.087338 0.075054 0.089630 0.098173 0.092034 0.076888 0.161388 0.149675 0.059230 0.062025 0.093885 0.080216 0.081055
qa: -0.1586 -0.3628 -0.4928 0.0005 0.1184 -0.1063 -0.1554 -0.0451 -0.1558 -0.1590 -0.0172 -0.0861 -0.0795 0.3134 -0.1961 -0.2693 -0.2738 -0.0006 -0.1134 -0.0694 -0.2787 0.1033 0.1135 0.0778 0.0924 0.0737 0.0966 0.1093 0.0924 0.1410 0.1452 0.1554 0.0847 0.0957 0.0873 0.0751 0.0896 0.0982 0.0920 0.0769 0.1614 0.1497 0.0592 0.0620 0.0939 0.0802 0.0811
va: 1.1171 1.9400 2.0243 2.9857 3.6647 3.8419 3.7501 3.8367 3.8912 3.8351 3.9222 3.8089 3.7945 4.1143 3.9773 3.9163 3.9317 3.8998 4.0077 3.8827 3.9554 1.0354 1.0000 1.0116 0.9999 1.0344 1.0002 1.0025 0.9863 0.9986 0.9959 0.9922 1.0053 1.0053 1.0038 1.0123 1.0061 1.0032 0.9962 0.9886 1.0071 0.9910 1.0124 1.0132 1.0034 1.0005 1.0016
dispcorr: -0.026916458 hartree
energy: -1329.025646386857
dipole: 10.12280 -11.40436 -1.28156 16.70315 -14.13485 2.56829 -8.82541 7.48716 -1.33825
magnitude: 3.16693 au
magnitude: 8.04970 debye
