program: Gaussian 09
title: 000056243
version: EM64L-G09RevD.01
frameworkgroup: C1[X(C15H18N2O2)]
method: RPBEPBE
basis: SDD
operation: Freq
keyword: #p
keyword: freq=noraman
keyword: PBEPBE/SDD
title: #p freq=noraman PBEPBE/SDD
converged: YES YES NO NO
title: Mulliken charges:
elementType: O O N N C C C C C C C C C C C C C C C H H H H H H H H H H H H H H H H H H
charge: -0.292215 -0.259092 -0.472121 -0.671612 0.133612 0.089310 0.042889 0.272684 0.392635 -0.589958 0.323840 -0.424733 -0.758074 0.089692 0.141001 -0.354932 -0.830136 -0.811455 -0.518630 0.314652 0.251272 0.222972 0.191196 0.262595 0.263005 0.245206 0.319199 0.326820 0.223530 0.256794 0.229492 0.238639 0.220132 0.262814 0.218593 0.216366 0.234018
chargesum: 0.00000
title: Mulliken charges with hydrogens summed into heavy atoms:
elementType: O O N N C C C C C C C C C C C C C C C
charge: -0.292215 -0.259092 -0.157469 -0.025594 0.133612 0.089310 0.042889 0.272684 0.392635 -0.338687 0.323840 -0.201760 -0.041278 0.089692 0.141001 -0.109727 -0.120320 -0.089869 0.150347
polarizability: 3.32633033e+02 1.07423433e+00 1.89345595e+02 1.53240567e+00 -3.86273371e+00 1.03520545e+02
1716.lowfreq: -5.8284 -1.7442 0.0002 0.0003 0.0005 2.8334 37.2062 40.1723 55.8226
frequency: 37.1304 40.1245 55.7969 65.5416 66.7130 103.9121 110.7072 125.2948 136.4501 153.8960 193.3301 202.1136 206.2215 220.6264 238.5579 253.7893 273.8130 291.2076 311.2441 334.5565 346.5697 365.1933 412.7104 413.7626 423.9264 449.9823 476.2907 543.2828 554.5176 562.9239 582.3772 598.0588 608.7572 621.1407 662.6951 680.0087 714.8154 723.7626 747.9592 774.4565 830.2425 886.2152 907.3242 929.9948 950.8724 958.9674 983.7754 991.1601 1019.8636 1037.6390 1045.1206 1051.9435 1058.9059 1088.1030 1107.9537 1110.3012 1150.7505 1174.4633 1201.9538 1221.0452 1262.8901 1275.3882 1299.4255 1339.8166 1358.8295 1365.9736 1393.8667 1405.5564 1411.8675 1432.7392 1436.8526 1446.0444 1456.8615 1457.3286 1463.5693 1467.4347 1468.0657 1472.3798 1482.9203 1490.2418 1509.7524 1521.8299 1556.6987 1564.9825 1597.0232 1613.7184 1636.4635 2952.6833 2961.6247 2973.3413 2981.8296 3037.4089 3051.3773 3055.5166 3075.2521 3079.7109 3094.0139 3110.7407 3115.5119 3117.8680 3121.0778 3155.8298 3548.2307 3582.8088 3691.9326
redmass: 5.1936 3.2544 3.1388 4.0341 2.7247 3.6488 1.1799 1.0730 2.7957 1.1228 3.7000 2.8916 3.7192 1.3925 4.0253 3.3713 2.9717 3.5336 3.7192 2.3068 1.6017 4.3525 2.6040 1.8877 3.7308 3.1953 3.4402 5.0291 3.4534 3.7552 3.6164 4.4085 1.1752 3.3766 5.0152 3.8766 5.4285 5.4460 3.8433 5.5269 1.4962 3.5077 1.3950 2.2428 1.3833 7.9352 1.5726 1.5789 1.6818 1.5189 1.6915 1.9382 2.6544 2.2404 2.2834 1.2460 1.3560 1.7585 2.7106 2.8308 1.4965 3.8041 1.8389 3.8735 1.3069 5.2620 1.2376 2.9005 1.2872 1.3269 1.0455 1.5758 1.0960 1.1602 2.7702 1.0596 1.1197 1.0523 1.1579 2.1830 3.6096 4.6373 5.5343 6.5242 4.8860 6.2061 1.2379 1.0317 1.0389 1.0403 1.0374 1.1037 1.0971 1.0926 1.0969 1.0991 1.1000 1.1002 1.0972 1.0896 1.0892 1.0955 1.0461 1.0801 1.1014
irintensity: 0.5154 1.1180 1.2117 8.1806 1.7776 1.9280 1.4426 0.5422 10.4023 0.2587 2.1419 1.8477 8.4427 16.6805 3.9505 1.2548 1.0363 6.8883 0.4070 48.0378 19.7991 6.9833 66.3071 90.0719 16.1617 2.6381 8.4840 2.9820 8.9818 6.2799 6.9100 21.6995 73.3626 8.6575 2.4809 12.7771 4.3094 2.0567 1.4983 10.4941 37.0921 0.1743 14.4659 49.1461 4.1014 58.6373 1.6595 4.4538 0.9416 10.4913 10.2111 0.5477 18.9486 26.9178 46.7511 2.3818 2.6733 18.7029 35.4548 105.7967 29.3007 39.3814 24.3496 23.8093 47.0856 10.7408 16.0563 16.1851 12.5910 4.6809 12.7177 9.5817 48.5387 135.9760 66.9532 11.5169 9.4352 18.3996 17.5721 47.9091 69.0351 2.3417 442.2291 35.5458 140.9665 58.7050 162.9953 80.8875 8.2538 37.3149 36.0324 52.2694 15.9345 20.3627 7.6123 19.5152 9.6780 41.4028 17.0998 12.9286 14.4593 12.1958 17.3959 43.7545 51.9209
temp: 298.150 k
press: 1.00000 atm
elementType: 8 8 7 7 6 6 6 6 6 6 6 6 6 6 6 6 6 6 6 1 1 1 1 1 1 1 1 1 1 1 1 1 1 1 1 1 1
symmnumber: 1
zpe: 785265.2 jmol-1
zpe.correction: 0.299092 hartree
zpe.thermalcorrener: 0.319167 hartree
zpe.thermalcorrenthalpy: 0.320111 hartree
zpe.thermalcorrgfe: 0.250398 hartree
zpe.sumelectzpe: -840.954992 hartree
zpe.sumelectthermal: -840.934917 hartree
zpe.sumelectthermalent: -840.933973 hartree
zpe.sumelectthermalfe: -841.003686 hartree
dipole: 3.5617 1.2798 1.7798
dipole: 4.1822
quadrupole: -134.2295 -93.3251 -114.0843
quadrupole: 3.7580 8.0184 2.0566
quadrupole: -20.3499 20.5545 -0.2047 3.7580 8.0184 2.0566
hfenergy: -841.2540837 hartree
pointgroup: C01 [X(C15H18N2O2)]
dipole: 1.4030421 0.8458885 0.1526768 debye
polarizability: 332.421827|1.2723472|149.0133292|-5.9722217|-43.0788884|144.0640166 unknown
InChI: InChI=1S/C15H18N2O2/c1-8-7-11(5-6-12(8)19-4)15-14(16)13(10(3)18)9(2)17-15/h5-7,17H,16H2,1-4H3
charge 0 multiplicity 1
37 atoms
O  5.084644 -0.444789 0.050599
O  -5.324261 0.049099 0.24995
N  -1.380811 -1.359148 0.894815
N  -1.300457 1.757121 -0.935166
C  -0.646104 -0.345119 0.230498
C  -1.604493 0.571604 -0.261729
C  -2.931091 0.076332 0.104707
C  -2.734749 -1.141626 0.824613
C  0.815235 -0.348391 0.188654
C  1.52756 0.224335 -0.907667
C  2.940638 0.240454 -0.973571
C  1.581074 -0.952599 1.231445
C  -3.727213 -2.098276 1.413528
C  -4.263177 0.621576 -0.173376
C  3.664935 -0.360769 0.093471
C  2.987079 -0.964331 1.176046
C  3.661898 0.83378 -2.169321
C  -4.396454 1.907408 -0.997363
C  5.782727 0.763791 0.522379
H  -0.952259 -2.196488 1.287972
H  0.964615 0.601986 -1.770328
H  1.077157 -1.380448 2.106773
H  -3.218679 -2.965233 1.875876
H  -4.352948 -1.599042 2.173677
H  -4.432132 -2.459449 0.644778
H  3.579368 -1.436045 1.967411
H  -0.332769 2.071042 -0.957637
H  -2.020981 2.455044 -1.086415
H  3.909953 1.901462 -2.007898
H  4.609462 0.300303 -2.356457
H  3.036995 0.776456 -3.077329
H  -3.875392 1.822095 -1.969959
H  -3.98043 2.774066 -0.444449
H  -5.465372 2.099071 -1.178375
H  5.517627 0.98612 1.574937
H  5.542593 1.643974 -0.106489
H  6.857812 0.538035 0.447401
