program: Orca
programVersion: 5.0.2
elementType: Cl O O N C C C C C C C C C C C C C C C C C H H H H H H H H H H H H H H H H H H H H H H H H H H
charge: 0
multiplicity: 1
keywords: wb97x-d3
keywords: def2-TZVPP
keywords: def2/J RIJCOSX
keywords: DEFGRID2
keywords: scfconv7
keywords: smallprint printgap noloewdin
keywords: NOSOSCF
formula: C17H26ClNO2
InChI: InChI=1/C17H26ClNO2/c1-4-11-21-12-10-19(16(20)13-18)17-14(5-2)8-7-9-15(17)6-3/h7-9H,4-6,10-13H2,1-3H3
47 atoms
Cl -1.857071 -3.036585 1.290539
O  3.105896 0.226975 -1.609959
O  0.882186 -1.722221 1.595881
N  0.066377 0.095522 0.538622
C  -1.021378 0.931277 0.138975
C  -1.791016 0.59984 -0.984113
C  -1.248786 2.109996 0.862458
C  1.404314 0.499175 0.11229
C  -1.593484 -0.672583 -1.770106
C  -0.479971 2.457707 2.109688
C  1.845198 -0.207641 -1.169012
C  -2.787329 1.491078 -1.378268
C  -2.255705 2.967514 0.434174
C  -0.066168 -1.018356 1.291514
C  -3.017544 2.664503 -0.682027
C  -2.879123 -1.463864 -1.988458
C  -1.241024 2.078246 3.377726
C  4.200418 -0.219483 -0.832616
C  -1.4569 -1.367493 1.789482
C  5.471721 -0.116901 -1.651051
C  5.475838 -1.004348 -2.886868
H  1.392146 1.575949 -0.059127
H  2.107645 0.307994 0.923799
H  -0.86639 -1.319125 -1.281782
H  -1.158997 -0.423631 -2.742852
H  0.498387 1.978197 2.12283
H  -0.292299 3.533572 2.118099
H  1.834926 -1.295316 -1.021282
H  1.142784 0.022034 -1.972797
H  -3.389854 1.266167 -2.249725
H  -2.440566 3.884106 0.982328
H  -3.792594 3.345171 -1.01099
H  -2.658231 -2.401941 -2.499039
H  -3.597599 -0.923598 -2.604793
H  -3.364999 -1.70835 -1.043734
H  -2.199604 2.595838 3.435832
H  -0.665825 2.343868 4.265657
H  -1.440531 1.006843 3.422386
H  4.302834 0.379542 0.080696
H  4.044455 -1.260479 -0.515834
H  -2.249584 -0.716639 1.436038
H  -1.448077 -1.344676 2.878777
H  5.641123 0.925963 -1.934283
H  6.302185 -0.392124 -0.995873
H  5.328891 -2.05333 -2.620724
H  6.425955 -0.932252 -3.41775
H  4.689875 -0.727859 -3.59003
elementType: Cl O N C H
totalener: -1328.99622887 hartree
nucrepener: 1927.32872887 hartree
electener: -3256.32495774 hartree
oneelecener: -5645.61773375 hartree
twoeener: 2389.29277602 hartree
cpcmener: -0.02799338 hartree
kineticenergy: 1324.23844564 hartree
xcener: -107.416926647877 hartree
chargesum: -0.0000000
charge: -0.156522 -0.387390 -0.503263 0.002276 0.088515 -0.107986 -0.127671 -0.038990 -0.180716 -0.151748 -0.011161 -0.084963 -0.078242 0.302519 -0.185150 -0.278023 -0.269535 0.025033 -0.091080 -0.098406 -0.257275 0.111079 0.112700 0.076187 0.101336 0.083717 0.089304 0.096667 0.110127 0.143192 0.140554 0.155504 0.097930 0.091569 0.077074 0.088179 0.096884 0.085172 0.085460 0.079860 0.144208 0.158059 0.059785 0.062770 0.076926 0.090023 0.075513
qa: -0.1565 -0.3874 -0.5033 0.0023 0.0885 -0.1080 -0.1277 -0.0390 -0.1807 -0.1517 -0.0112 -0.0850 -0.0782 0.3025 -0.1852 -0.2780 -0.2695 0.0250 -0.0911 -0.0984 -0.2573 0.1111 0.1127 0.0762 0.1013 0.0837 0.0893 0.0967 0.1101 0.1432 0.1406 0.1555 0.0979 0.0916 0.0771 0.0882 0.0969 0.0852 0.0855 0.0799 0.1442 0.1581 0.0598 0.0628 0.0769 0.0900 0.0755
va: 1.1187 1.9424 2.0171 2.9700 3.7191 3.7662 3.8872 3.6893 3.8715 3.9060 3.9551 3.8127 3.8102 4.1160 3.9644 3.9330 3.9146 3.8928 3.9917 3.9137 3.9184 1.0074 1.0155 1.0152 0.9979 1.0074 1.0018 1.0083 0.9970 0.9982 0.9989 0.9920 1.0027 1.0062 1.0127 1.0029 1.0053 1.0041 0.9936 0.9902 1.0020 1.0037 1.0140 1.0121 1.0026 1.0051 1.0150
dispcorr: -0.025901173 hartree
energy: -1329.022130041761
dipole: 16.13074 -16.99105 -0.86031 11.66529 -9.69455 1.97074 -9.60675 9.63176 0.02501
magnitude: 2.15048 au
magnitude: 5.46610 debye
