program: Orca
programVersion: 5.0.2
elementType: Cl O O N C C C C C C C C C C C C C C C C C H H H H H H H H H H H H H H H H H H H H H H H H H H
charge: 0
multiplicity: 1
keywords: wb97x-d3
keywords: def2-TZVPP
keywords: def2/J RIJCOSX
keywords: DEFGRID2
keywords: scfconv7
keywords: smallprint printgap noloewdin
keywords: NOSOSCF
formula: C17H26ClNO2
InChI: InChI=1/C17H26ClNO2/c1-4-11-21-12-10-19(16(20)13-18)17-14(5-2)8-7-9-15(17)6-3/h7-9H,4-6,10-13H2,1-3H3
47 atoms
Cl -2.229113 -1.711664 2.613428
O  1.944909 -0.175317 -1.854975
O  -0.070366 -3.480425 0.643494
N  0.170144 -1.245481 0.374615
C  -0.4328 0.038111 0.201251
C  -1.102753 0.329668 -0.999658
C  -0.331897 0.98315 1.229285
C  1.624793 -1.343439 0.293975
C  -1.259653 -0.688138 -2.104313
C  0.358552 0.715052 2.542507
C  2.192644 -1.344914 -1.116618
C  -1.672543 1.590565 -1.142587
C  -0.904901 2.237807 1.033223
C  -0.557142 -2.36171 0.608405
C  -1.570423 2.541409 -0.139722
C  -1.12936 -0.128374 -3.515857
C  1.618323 1.55577 2.735438
C  2.643313 0.969204 -1.415752
C  -2.038555 -2.18653 0.894667
C  2.236083 2.161603 -2.257554
C  2.915753 3.435639 -1.78053
H  2.056552 -0.530571 0.877649
H  1.939436 -2.265221 0.781337
H  -2.242241 -1.162297 -2.006381
H  -0.536166 -1.492324 -1.983957
H  -0.341887 0.943613 3.349557
H  0.599253 -0.341762 2.652018
H  3.272512 -1.537158 -1.034188
H  1.762348 -2.172082 -1.685562
H  -2.20502 1.839985 -2.051485
H  -0.840924 2.978289 1.822107
H  -2.018879 3.517776 -0.272992
H  -1.17082 -0.94162 -4.241439
H  -0.18078 0.389223 -3.655312
H  -1.930533 0.564382 -3.770673
H  1.39541 2.623469 2.723902
H  2.356854 1.367119 1.954729
H  2.086498 1.33025 3.694556
H  2.429471 1.191014 -0.362187
H  3.728797 0.804871 -1.48883
H  -2.539706 -3.14112 0.758007
H  -2.538158 -1.433693 0.293506
H  2.482668 1.976367 -3.306635
H  1.150882 2.285475 -2.202352
H  2.649145 3.664913 -0.746844
H  2.621203 4.290276 -2.390084
H  4.003401 3.356921 -1.831227
elementType: Cl O N C H
totalener: -1328.99497351 hartree
nucrepener: 2031.50403939 hartree
electener: -3360.49901289 hartree
oneelecener: -5854.36374556 hartree
twoeener: 2493.86473267 hartree
cpcmener: -0.02580058 hartree
kineticenergy: 1324.23954079 hartree
xcener: -107.423086820395 hartree
chargesum: 0.0000000
charge: -0.157236 -0.371230 -0.497407 0.034539 0.197340 -0.188988 -0.199296 -0.114865 -0.154138 -0.149071 0.016603 -0.069368 -0.071246 0.297087 -0.205406 -0.280058 -0.275226 0.030570 -0.063118 -0.081529 -0.279287 0.131634 0.106137 0.096952 0.094639 0.089837 0.073391 0.097061 0.100496 0.140392 0.139234 0.154291 0.096562 0.081097 0.088484 0.089128 0.086276 0.101286 0.050473 0.097490 0.147595 0.139884 0.069853 0.051865 0.079640 0.094129 0.083505
qa: -0.1572 -0.3712 -0.4974 0.0345 0.1973 -0.1890 -0.1993 -0.1149 -0.1541 -0.1491 0.0166 -0.0694 -0.0712 0.2971 -0.2054 -0.2801 -0.2752 0.0306 -0.0631 -0.0815 -0.2793 0.1316 0.1061 0.0970 0.0946 0.0898 0.0734 0.0971 0.1005 0.1404 0.1392 0.1543 0.0966 0.0811 0.0885 0.0891 0.0863 0.1013 0.0505 0.0975 0.1476 0.1399 0.0699 0.0519 0.0796 0.0941 0.0835
va: 1.1188 1.9353 2.0122 2.9711 3.4454 3.7588 3.7402 3.7812 3.8661 3.8612 3.8888 3.7407 3.7909 4.1273 3.9880 3.9460 3.9332 3.9239 3.9558 3.8685 3.9668 0.9889 1.0431 0.9955 1.0052 1.0022 1.0183 1.0042 0.9994 0.9965 0.9976 0.9928 1.0044 1.0104 1.0003 1.0035 0.9987 1.0053 0.9748 1.0002 1.0107 1.0145 1.0133 1.0128 1.0008 1.0033 1.0022
dispcorr: -0.030157860 hartree
energy: -1329.025131366585
dipole: 19.70674 -19.32484 0.38189 20.42349 -18.63620 1.78729 -17.14508 16.66188 -0.48319
magnitude: 1.89042 au
magnitude: 4.80508 debye
