program: Orca
programVersion: 5.0.2
elementType: Cl O O N C C C C C C C C C C C C C C C C C H H H H H H H H H H H H H H H H H H H H H H H H H H
charge: 0
multiplicity: 1
keywords: wb97x-d3
keywords: def2-TZVPP
keywords: def2/J RIJCOSX
keywords: DEFGRID2
keywords: scfconv7
keywords: smallprint printgap noloewdin
keywords: NOSOSCF
formula: C17H26ClNO2
InChI: InChI=1/C17H26ClNO2/c1-4-11-21-12-10-19(16(20)13-18)17-14(5-2)8-7-9-15(17)6-3/h7-9H,4-6,10-13H2,1-3H3
47 atoms
Cl -3.062503 -2.104839 0.849491
O  2.686269 0.181902 -0.430331
O  0.060247 -3.338262 1.231524
N  0.184745 -1.295392 0.279108
C  -0.325931 0.027462 0.143281
C  -1.143866 0.34099 -0.946371
C  0.025146 0.986021 1.106174
C  1.310685 -1.76146 -0.532671
C  -1.501011 -0.693269 -1.985257
C  0.910814 0.611567 2.26878
C  2.020782 -0.677765 -1.309332
C  -1.606753 1.649525 -1.063183
C  -0.478146 2.272044 0.961667
C  -0.3773 -2.215295 1.111057
C  -1.281465 2.602853 -0.118025
C  -2.901275 -0.555383 -2.569261
C  1.475744 1.779672 3.062511
C  3.353889 1.249978 -1.05407
C  -1.627788 -1.798183 1.871253
C  2.441397 2.377164 -1.516681
C  3.243995 3.511355 -2.137704
H  2.029971 -2.263424 0.11678
H  0.960452 -2.514029 -1.246203
H  -1.404581 -1.68937 -1.554656
H  -0.769425 -0.649026 -2.800208
H  0.358637 -0.038374 2.957478
H  1.737172 0.006847 1.896536
H  2.73656 -1.181543 -1.97718
H  1.31975 -0.139465 -1.958834
H  -2.238032 1.925636 -1.897083
H  -0.234069 3.034444 1.688844
H  -1.656197 3.613129 -0.219876
H  -3.652489 -0.544044 -1.780444
H  -3.117231 -1.398921 -3.224398
H  -3.022423 0.349521 -3.164504
H  0.701852 2.356536 3.569874
H  2.039474 2.460659 2.423512
H  2.155859 1.412163 3.830259
H  4.061076 1.637338 -0.315639
H  3.954421 0.886502 -1.902982
H  -1.657514 -0.750778 2.157576
H  -1.714288 -2.425469 2.754491
H  1.711359 2.011107 -2.243287
H  1.862104 2.742452 -0.665936
H  3.962461 3.92887 -1.430168
H  2.59406 4.323787 -2.460609
H  3.80444 3.175024 -3.011855
totalener: -1328.96979038 hartree
nucrepener: 2021.07483695 hartree
electener: -3350.04462733 hartree
oneelecener: -5833.24051967 hartree
twoeener: 2483.19589234 hartree
kineticenergy: 1324.29711070 hartree
xcener: -107.430568461136 hartree
chargesum: 0.0000000
charge: -0.130111 -0.319083 -0.375781 0.001106 0.178621 -0.168683 -0.221420 -0.058729 -0.198169 -0.103699 -0.016936 -0.044003 -0.076563 0.251170 -0.159035 -0.251821 -0.281931 0.007687 -0.094625 -0.072991 -0.259554 0.113447 0.099144 0.096978 0.079488 0.075866 0.101397 0.093642 0.077217 0.114628 0.119207 0.124017 0.091675 0.089969 0.075678 0.076539 0.087986 0.094241 0.086349 0.063970 0.129777 0.147019 0.052449 0.061067 0.076235 0.088369 0.078195
qa: -0.1301 -0.3191 -0.3758 0.0011 0.1786 -0.1687 -0.2214 -0.0587 -0.1982 -0.1037 -0.0169 -0.0440 -0.0766 0.2512 -0.1590 -0.2518 -0.2819 0.0077 -0.0946 -0.0730 -0.2596 0.1134 0.0991 0.0970 0.0795 0.0759 0.1014 0.0936 0.0772 0.1146 0.1192 0.1240 0.0917 0.0900 0.0757 0.0765 0.0880 0.0942 0.0863 0.0640 0.1298 0.1470 0.0524 0.0611 0.0762 0.0884 0.0782
va: 1.1494 1.9842 2.1414 2.9156 3.5578 3.7686 3.8195 3.8441 3.8927 3.8690 3.9643 3.8335 3.7780 4.1371 4.0688 3.9367 3.9642 3.9360 3.9728 3.8420 3.9682 1.0183 1.0072 1.0089 0.9962 0.9976 1.0210 1.0049 0.9777 1.0037 1.0046 1.0028 1.0150 1.0066 1.0024 0.9989 0.9998 1.0072 0.9987 1.0006 1.0072 1.0055 1.0110 1.0107 1.0042 1.0038 1.0040
dispcorr: -0.029371991 hartree
energy: -1328.999162372183
dipole: 19.86752 -19.39120 0.47631 22.24969 -20.64799 1.60170 -11.21847 10.59341 -0.62506
magnitude: 1.78410 au
magnitude: 4.53483 debye
