program: Orca
programVersion: 5.0.2
elementType: Cl O O N C C C C C C C C C C C C C C C C C H H H H H H H H H H H H H H H H H H H H H H H H H H
charge: 0
multiplicity: 1
keywords: wb97x-d3
keywords: def2-TZVPP
keywords: def2/J RIJCOSX
keywords: DEFGRID2
keywords: scfconv7
keywords: smallprint printgap noloewdin
keywords: NOSOSCF
formula: C17H26ClNO2
InChI: InChI=1/C17H26ClNO2/c1-4-11-21-12-10-19(16(20)13-18)17-14(5-2)8-7-9-15(17)6-3/h7-9H,4-6,10-13H2,1-3H3
47 atoms
Cl -1.448282 -3.002077 1.057968
O  2.258689 0.307325 -1.347725
O  0.907936 -1.373682 2.29071
N  0.224803 0.272367 0.90854
C  -0.812729 1.002325 0.254772
C  -1.283677 0.603551 -1.002337
C  -1.315779 2.145935 0.890709
C  1.581619 0.812779 0.879984
C  -0.779807 -0.621466 -1.722449
C  -0.880275 2.564708 2.270954
C  2.552555 0.052362 -0.001514
C  -2.261946 1.387006 -1.610356
C  -2.288597 2.897705 0.244325
C  0.014454 -0.827364 1.681972
C  -2.759169 2.523658 -1.001583
C  -1.887791 -1.529116 -2.249894
C  -1.792113 2.008183 3.362505
C  2.801164 -0.618332 -2.252074
C  -1.405336 -1.367201 1.76999
C  4.315585 -0.553969 -2.397437
C  4.807588 -1.521719 -3.465028
H  1.522663 1.845791 0.536077
H  1.982324 0.823831 1.895452
H  -0.127899 -1.204414 -1.075462
H  -0.152142 -0.29388 -2.554633
H  0.14728 2.265521 2.475212
H  -0.890764 3.655787 2.324331
H  3.566245 0.388903 0.258582
H  2.506861 -1.019686 0.227291
H  -2.635179 1.104781 -2.586407
H  -2.678583 3.786397 0.726438
H  -3.512546 3.119634 -1.499788
H  -2.501052 -1.042309 -3.008068
H  -2.546468 -1.86155 -1.448825
H  -1.45604 -2.418457 -2.708712
H  -1.478603 2.357344 4.346343
H  -1.775482 0.91841 3.382848
H  -2.826021 2.317841 3.209225
H  2.505033 -1.643471 -1.97889
H  2.337251 -0.4032 -3.218826
H  -2.156054 -0.763363 1.268717
H  -1.669138 -1.465904 2.821905
H  4.60906 0.467795 -2.651127
H  4.799398 -0.791015 -1.445824
H  5.891329 -1.480856 -3.567978
H  4.37691 -1.292074 -4.441068
H  4.541191 -2.552086 -3.223783
totalener: -1328.97056532 hartree
nucrepener: 1967.43990589 hartree
electener: -3296.41047121 hartree
oneelecener: -5726.08385401 hartree
twoeener: 2429.67338280 hartree
kineticenergy: 1324.29630694 hartree
xcener: -107.423687677162 hartree
chargesum: 0.0000000
charge: -0.122335 -0.317444 -0.384833 0.006685 0.030725 -0.072693 -0.084167 -0.049882 -0.189237 -0.183971 -0.029680 -0.060649 -0.060443 0.252640 -0.150441 -0.239451 -0.242607 0.006234 -0.111987 -0.083403 -0.256632 0.106080 0.100579 0.066221 0.095098 0.090152 0.083028 0.073339 0.100139 0.114764 0.111440 0.125698 0.077762 0.076383 0.088895 0.092949 0.073445 0.085552 0.067036 0.077917 0.133387 0.141051 0.064065 0.058436 0.088154 0.075338 0.076664
qa: -0.1223 -0.3174 -0.3848 0.0067 0.0307 -0.0727 -0.0842 -0.0499 -0.1892 -0.1840 -0.0297 -0.0606 -0.0604 0.2526 -0.1504 -0.2395 -0.2426 0.0062 -0.1120 -0.0834 -0.2566 0.1061 0.1006 0.0662 0.0951 0.0902 0.0830 0.0733 0.1001 0.1148 0.1114 0.1257 0.0778 0.0764 0.0889 0.0929 0.0734 0.0856 0.0670 0.0779 0.1334 0.1411 0.0641 0.0584 0.0882 0.0753 0.0767
va: 1.1503 1.9756 2.1341 2.9406 3.8318 3.8149 3.8662 3.9115 3.9190 3.9356 3.9719 3.8700 3.8823 4.1124 4.0279 3.9188 3.9115 3.9453 4.0134 3.8725 3.9520 1.0048 1.0171 1.0185 1.0031 1.0049 1.0029 0.9954 0.9971 1.0070 1.0068 1.0018 1.0084 1.0205 1.0066 1.0092 1.0120 1.0042 0.9953 0.9943 1.0002 1.0046 1.0119 1.0106 1.0057 1.0040 1.0037
dispcorr: -0.027131050 hartree
energy: -1328.997696373087
dipole: 13.73959 -13.92076 -0.18117 9.07087 -7.90035 1.17053 -12.67934 12.15981 -0.51953
magnitude: 1.29340 au
magnitude: 3.28755 debye
