program: Orca
programVersion: 5.0.2
elementType: Cl O O N C C C C C C C C C C C C C C C C C H H H H H H H H H H H H H H H H H H H H H H H H H H
charge: 0
multiplicity: 1
keywords: wb97x-d3
keywords: def2-TZVPP
keywords: def2/J RIJCOSX
keywords: DEFGRID2
keywords: scfconv7
keywords: smallprint printgap noloewdin
keywords: NOSOSCF
formula: C17H26ClNO2
InChI: InChI=1/C17H26ClNO2/c1-4-11-21-12-10-19(16(20)13-18)17-14(5-2)8-7-9-15(17)6-3/h7-9H,4-6,10-13H2,1-3H3
47 atoms
Cl -2.44866 -2.368174 1.161415
O  3.337201 0.516645 -1.289713
O  0.988697 -2.086619 1.253076
N  0.021195 -0.378536 0.135576
C  -1.019707 0.585455 0.005981
C  -1.97554 0.40675 -1.006365
C  -1.043573 1.707997 0.843767
C  1.108229 -0.346887 -0.834876
C  -1.923268 -0.781492 -1.933908
C  -0.02018 1.951862 1.927317
C  2.310347 0.457667 -0.342854
C  -2.96228 1.373019 -1.155864
C  -2.053451 2.647619 0.657399
C  0.052456 -1.33171 1.107346
C  -3.003731 2.484552 -0.331838
C  -3.282727 -1.318488 -2.36247
C  -0.622349 2.154977 3.316094
C  4.076388 -0.672066 -1.447421
C  -1.170549 -1.445418 2.003351
C  5.417486 -0.343866 -2.07412
C  6.284949 0.552883 -1.203263
H  1.400083 -1.372903 -1.063338
H  0.732009 0.10016 -1.755805
H  -1.366787 -1.589979 -1.462021
H  -1.349145 -0.507406 -2.825811
H  0.702479 1.138533 1.969017
H  0.558559 2.841551 1.66166
H  2.002815 1.489076 -0.153558
H  2.667813 0.035588 0.606441
H  -3.71331 1.259745 -1.926151
H  -2.087581 3.526348 1.289632
H  -3.778523 3.227806 -0.466687
H  -3.156602 -2.235388 -2.937521
H  -3.831617 -0.620406 -2.994214
H  -3.901859 -1.548862 -1.496205
H  -1.280087 3.02254 3.356077
H  0.165066 2.309897 4.053349
H  -1.206364 1.291094 3.634754
H  4.230836 -1.1621 -0.474492
H  3.540759 -1.391941 -2.080991
H  -1.599249 -0.488723 2.288803
H  -0.892018 -2.004055 2.892719
H  5.933169 -1.288325 -2.267776
H  5.255681 0.121211 -3.049987
H  6.480278 0.090673 -0.233775
H  5.805858 1.513758 -1.022571
H  7.248814 0.745039 -1.674551
totalener: -1328.97088748 hartree
nucrepener: 1936.67041697 hartree
electener: -3265.64130445 hartree
oneelecener: -5664.25156613 hartree
twoeener: 2398.61026168 hartree
kineticenergy: 1324.29571405 hartree
xcener: -107.425112166237 hartree
chargesum: 0.0000000
charge: -0.129111 -0.332310 -0.377758 0.007759 0.080138 -0.094600 -0.165054 -0.020498 -0.219027 -0.246693 -0.011956 -0.039221 -0.032548 0.234748 -0.170669 -0.252358 -0.224591 0.011503 -0.069339 -0.098171 -0.243223 0.110321 0.101263 0.098023 0.088712 0.091723 0.102748 0.093705 0.088353 0.116289 0.115148 0.125308 0.089544 0.077327 0.089340 0.079656 0.093530 0.071227 0.076259 0.070253 0.115360 0.146751 0.055777 0.060086 0.066396 0.087076 0.082804
qa: -0.1291 -0.3323 -0.3778 0.0078 0.0801 -0.0946 -0.1651 -0.0205 -0.2190 -0.2467 -0.0120 -0.0392 -0.0325 0.2347 -0.1707 -0.2524 -0.2246 0.0115 -0.0693 -0.0982 -0.2432 0.1103 0.1013 0.0980 0.0887 0.0917 0.1027 0.0937 0.0884 0.1163 0.1151 0.1253 0.0895 0.0773 0.0893 0.0797 0.0935 0.0712 0.0763 0.0703 0.1154 0.1468 0.0558 0.0601 0.0664 0.0871 0.0828
va: 1.1518 1.9932 2.1317 2.9034 3.8077 3.7886 3.7674 3.6919 3.9022 3.9236 3.9776 3.8516 3.8559 4.1723 4.0694 3.9386 3.9278 3.9301 3.9733 3.9241 3.9229 1.0139 1.0096 1.0086 0.9962 1.0056 0.9948 0.9958 1.0093 1.0051 1.0041 1.0030 1.0069 1.0020 1.0131 1.0075 1.0067 1.0103 0.9894 0.9950 1.0232 1.0062 1.0119 1.0146 1.0060 1.0144 1.0064
dispcorr: -0.025850985 hartree
energy: -1328.996738460439
dipole: 20.50695 -20.94272 -0.43577 11.77640 -10.80402 0.97239 -7.48236 7.43142 -0.05093
magnitude: 1.06678 au
magnitude: 2.71155 debye
