program: Orca
programVersion: 5.0.2
elementType: Cl O O N C C C C C C C C C C C C C C C C C H H H H H H H H H H H H H H H H H H H H H H H H H H
charge: 0
multiplicity: 1
keywords: wb97x-d3
keywords: def2-TZVPP
keywords: def2/J RIJCOSX
keywords: DEFGRID2
keywords: scfconv7
keywords: smallprint printgap noloewdin
keywords: NOSOSCF
formula: C17H26ClNO2
InChI: InChI=1/C17H26ClNO2/c1-4-11-21-12-10-19(16(20)13-18)17-14(5-2)8-7-9-15(17)6-3/h7-9H,4-6,10-13H2,1-3H3
47 atoms
Cl -2.783462 -2.339479 1.18972
O  3.561649 -0.160746 -0.507124
O  0.645382 -2.497602 1.523442
N  0.00235 -0.611072 0.462773
C  -0.979522 0.394204 0.221143
C  -1.85048 0.242798 -0.866436
C  -1.051266 1.51875 1.052606
C  1.194766 -0.640856 -0.376206
C  -1.789857 -0.931127 -1.80769
C  -0.110533 1.75377 2.206064
C  2.466192 -0.220589 0.363675
C  -2.80727 1.225499 -1.090963
C  -2.033817 2.471017 0.798817
C  -0.174949 -1.621832 1.358474
C  -2.907498 2.329158 -0.263135
C  -1.249537 -0.556845 -3.18681
C  0.836387 2.926097 1.953243
C  3.680505 1.040987 -1.223962
C  -1.46714 -1.623025 2.160034
C  4.84118 0.923946 -2.191267
C  4.64758 -0.166102 -3.235953
H  1.334355 -1.641788 -0.789466
H  1.012562 0.035134 -1.211274
H  -2.798175 -1.3367 -1.917161
H  -1.193885 -1.739805 -1.387696
H  -0.694524 1.957436 3.10781
H  0.475103 0.860876 2.422131
H  2.305251 0.742131 0.867474
H  2.701026 -0.958439 1.130468
H  -3.496206 1.111632 -1.919662
H  -2.113677 3.335215 1.447848
H  -3.670433 3.075109 -0.443067
H  -1.857476 0.213983 -3.661212
H  -1.244143 -1.425736 -3.845059
H  -0.2285 -0.178845 -3.131748
H  0.291799 3.860994 1.822002
H  1.429998 2.767993 1.052497
H  1.523453 3.056548 2.789479
H  2.762943 1.273317 -1.786285
H  3.84662 1.883037 -0.535214
H  -1.792137 -0.633921 2.474016
H  -1.320733 -2.253862 3.032781
H  4.9667 1.893233 -2.681361
H  5.759407 0.743637 -1.626516
H  4.55262 -1.147574 -2.773972
H  5.492129 -0.202523 -3.924145
H  3.748721 0.011087 -3.83019
totalener: -1328.97061622 hartree
nucrepener: 1957.70010393 hartree
electener: -3286.67072015 hartree
oneelecener: -5706.21236287 hartree
twoeener: 2419.54164271 hartree
kineticenergy: 1324.30119327 hartree
xcener: -107.422997274287 hartree
chargesum: 0.0000000
charge: -0.124805 -0.323485 -0.377958 -0.003391 0.119433 -0.138747 -0.144823 -0.031535 -0.196841 -0.245712 -0.012588 -0.029501 -0.035384 0.230155 -0.176621 -0.230344 -0.230819 0.009538 -0.070190 -0.096338 -0.243183 0.111216 0.080406 0.096676 0.082869 0.098456 0.088382 0.065391 0.119097 0.115210 0.114297 0.125569 0.077018 0.092060 0.074178 0.084202 0.069068 0.096816 0.064973 0.073183 0.121761 0.144370 0.053398 0.063747 0.093563 0.084997 0.062233
qa: -0.1248 -0.3235 -0.3780 -0.0034 0.1194 -0.1387 -0.1448 -0.0315 -0.1968 -0.2457 -0.0126 -0.0295 -0.0354 0.2302 -0.1766 -0.2303 -0.2308 0.0095 -0.0702 -0.0963 -0.2432 0.1112 0.0804 0.0967 0.0829 0.0985 0.0884 0.0654 0.1191 0.1152 0.1143 0.1256 0.0770 0.0921 0.0742 0.0842 0.0691 0.0968 0.0650 0.0732 0.1218 0.1444 0.0534 0.0637 0.0936 0.0850 0.0622
va: 1.1492 2.0045 2.1281 2.9126 3.6891 3.7942 3.7304 3.7351 3.9170 3.9156 3.9735 3.8612 3.8559 4.1858 4.0651 3.9322 3.9136 3.9371 3.9763 3.9351 3.9205 1.0212 0.9958 0.9996 1.0163 0.9978 1.0110 1.0064 1.0159 1.0042 1.0041 1.0022 1.0068 1.0072 1.0047 1.0083 1.0114 1.0067 0.9747 0.9989 1.0088 1.0085 1.0114 1.0162 1.0138 1.0060 1.0062
dispcorr: -0.026723398 hartree
energy: -1328.997339622030
dipole: 23.83087 -24.29243 -0.46156 18.17285 -16.44349 1.72937 -15.94207 15.70419 -0.23788
magnitude: 1.80564 au
magnitude: 4.58958 debye
