program: Orca
programVersion: 5.0.2
elementType: Cl O O N C C C C C C C C C C C C C C C C C H H H H H H H H H H H H H H H H H H H H H H H H H H
charge: 0
multiplicity: 1
keywords: wb97x-d3
keywords: def2-TZVPP
keywords: def2/J RIJCOSX
keywords: DEFGRID2
keywords: scfconv7
keywords: smallprint printgap noloewdin
keywords: NOSOSCF
formula: C17H26ClNO2
InChI: InChI=1/C17H26ClNO2/c1-4-11-21-12-10-19(16(20)13-18)17-14(5-2)8-7-9-15(17)6-3/h7-9H,4-6,10-13H2,1-3H3
47 atoms
Cl -0.712113 -2.498082 1.13321
O  2.277575 -0.220832 -1.457525
O  1.765375 -0.243797 2.12126
N  0.340807 0.590223 0.57352
C  -1.01724 0.922452 0.273254
C  -1.646109 0.354079 -0.842865
C  -1.682329 1.847029 1.090289
C  1.375894 1.448072 0.001237
C  -0.916781 -0.583425 -1.766537
C  -1.021154 2.549397 2.248643
C  2.6237 0.758128 -0.524732
C  -2.966451 0.709238 -1.100886
C  -3.004966 2.162922 0.800248
C  0.657272 -0.205245 1.63154
C  -3.645572 1.597163 -0.28605
C  -1.761294 -1.722639 -2.323232
C  -0.617703 3.979977 1.892113
C  3.378627 -0.901556 -1.99808
C  -0.449535 -1.084953 2.194744
C  2.890527 -2.091745 -2.80018
C  2.231956 -3.170068 -1.950645
H  0.902391 1.993092 -0.815486
H  1.702222 2.191578 0.737215
H  -0.056416 -0.997716 -1.251696
H  -0.499403 -0.000315 -2.593861
H  -1.71858 2.577327 3.089646
H  -0.143546 2.011206 2.606783
H  3.2403 1.548074 -0.984349
H  3.210387 0.333957 0.29517
H  -3.476409 0.279372 -1.952724
H  -3.533556 2.863765 1.436017
H  -4.675773 1.849908 -0.500562
H  -2.243361 -2.281031 -1.521222
H  -1.12797 -2.416207 -2.876616
H  -2.537147 -1.383346 -3.010148
H  0.090055 3.997756 1.063453
H  -0.149389 4.475169 2.742987
H  -1.483061 4.572121 1.594285
H  3.968444 -0.229659 -2.639966
H  4.052349 -1.245991 -1.198491
H  -1.404624 -0.576025 2.300311
H  -0.123327 -1.457555 3.161869
H  2.201417 -1.742302 -3.57373
H  3.751015 -2.513305 -3.326738
H  1.363637 -2.7924 -1.412644
H  2.927268 -3.564485 -1.20775
H  1.90265 -4.006485 -2.56747
totalener: -1328.97041253 hartree
nucrepener: 2009.26293045 hartree
electener: -3338.23334298 hartree
oneelecener: -5810.07099946 hartree
twoeener: 2471.83765648 hartree
kineticenergy: 1324.30149219 hartree
xcener: -107.424176779820 hartree
chargesum: -0.0000000
charge: -0.129097 -0.313557 -0.387248 0.017713 0.043940 -0.028415 -0.176426 -0.094327 -0.101953 -0.201750 0.004101 -0.055326 -0.050832 0.228143 -0.155915 -0.254327 -0.238564 0.022057 -0.069919 -0.110827 -0.232738 0.109684 0.091689 0.016953 0.086480 0.088934 0.092660 0.072010 0.105720 0.115735 0.114260 0.124608 0.087500 0.086920 0.077208 0.080231 0.091911 0.082126 0.070631 0.062070 0.127102 0.142104 0.059025 0.065169 0.075841 0.075983 0.082715
qa: -0.1291 -0.3136 -0.3872 0.0177 0.0439 -0.0284 -0.1764 -0.0943 -0.1020 -0.2018 0.0041 -0.0553 -0.0508 0.2281 -0.1559 -0.2543 -0.2386 0.0221 -0.0699 -0.1108 -0.2327 0.1097 0.0917 0.0170 0.0865 0.0889 0.0927 0.0720 0.1057 0.1157 0.1143 0.1246 0.0875 0.0869 0.0772 0.0802 0.0919 0.0821 0.0706 0.0621 0.1271 0.1421 0.0590 0.0652 0.0758 0.0760 0.0827
va: 1.1474 1.9800 2.1181 2.8858 3.7227 3.8582 3.8154 3.9563 3.8897 3.9010 3.9298 3.8422 3.8743 4.1761 4.0483 3.9231 3.9138 3.9270 3.9473 3.9259 3.9353 0.9933 1.0067 1.0553 1.0105 1.0025 1.0149 0.9936 1.0128 1.0070 1.0037 1.0024 1.0154 1.0051 1.0061 1.0043 1.0065 1.0067 0.9951 0.9925 1.0068 1.0095 1.0138 1.0124 1.0007 1.0107 1.0050
dispcorr: -0.028513255 hartree
energy: -1328.998925785129
dipole: 8.00012 -8.42656 -0.42645 7.01397 -6.04298 0.97100 -13.49851 13.13251 -0.36600
magnitude: 1.12190 au
magnitude: 2.85163 debye
