program: Orca
programVersion: 5.0.2
elementType: Cl O O N C C C C C C C C C C C C C C C C C H H H H H H H H H H H H H H H H H H H H H H H H H H
charge: 0
multiplicity: 1
keywords: wb97x-d3
keywords: def2-TZVPP
keywords: def2/J RIJCOSX
keywords: DEFGRID2
keywords: scfconv7
keywords: smallprint printgap noloewdin
keywords: NOSOSCF
formula: C17H26ClNO2
InChI: InChI=1/C17H26ClNO2/c1-4-11-21-12-10-19(16(20)13-18)17-14(5-2)8-7-9-15(17)6-3/h7-9H,4-6,10-13H2,1-3H3
47 atoms
Cl -1.619394 -1.215544 3.044444
O  2.356294 0.412753 -1.700997
O  1.405164 -1.805847 1.697504
N  0.459133 -0.060771 0.620376
C  -0.709508 0.600404 0.136495
C  -1.264833 0.198093 -1.087882
C  -1.259701 1.643778 0.889213
C  1.737463 0.644771 0.594588
C  -0.649017 -0.933157 -1.871809
C  -0.645428 2.0829 2.195854
C  2.765018 0.121521 -0.391215
C  -2.394874 0.865404 -1.542854
C  -2.385924 2.289877 0.387053
C  0.41256 -1.253425 1.27457
C  -2.947969 1.905572 -0.814856
C  -1.234142 -1.176893 -3.254183
C  -1.638688 2.591906 3.232779
C  3.354143 0.258639 -2.678252
C  -0.959507 -1.865613 1.514424
C  3.886166 -1.159225 -2.844011
C  2.802183 -2.197425 -3.093349
H  1.532135 1.690505 0.365728
H  2.182096 0.608363 1.591621
H  -0.722171 -1.864759 -1.299728
H  0.417374 -0.736919 -1.970705
H  -0.089233 1.255194 2.634934
H  0.094935 2.864682 1.994674
H  3.7182 0.623398 -0.163582
H  2.923958 -0.950289 -0.236416
H  -2.849722 0.580152 -2.481357
H  -2.835312 3.099828 0.945426
H  -3.825552 2.417223 -1.188037
H  -0.692013 -1.985699 -3.743729
H  -1.147799 -0.294814 -3.88965
H  -2.284885 -1.46748 -3.220248
H  -2.420502 1.855642 3.417141
H  -2.116005 3.525686 2.936823
H  -1.128475 2.780939 4.176846
H  2.898984 0.588083 -3.615568
H  4.195667 0.937371 -2.472297
H  -0.840329 -2.938602 1.639284
H  -1.691346 -1.661941 0.73822
H  4.583169 -1.140976 -3.686687
H  4.484623 -1.44961 -1.976132
H  2.176799 -1.923942 -3.945321
H  2.14745 -2.314802 -2.229957
H  3.238681 -3.173437 -3.303998
totalener: -1328.97170271 hartree
nucrepener: 1988.70968269 hartree
electener: -3317.68138540 hartree
oneelecener: -5768.73011902 hartree
twoeener: 2451.04873362 hartree
kineticenergy: 1324.29424136 hartree
xcener: -107.428681896033 hartree
chargesum: -0.0000000
charge: -0.127767 -0.316645 -0.386267 0.011891 0.032013 -0.155553 -0.061258 -0.027664 -0.054126 -0.199728 -0.024228 -0.075432 -0.071538 0.255953 -0.153662 -0.299687 -0.256920 -0.002683 -0.103198 -0.111503 -0.257004 0.092265 0.102433 0.071192 0.055628 0.093733 0.084832 0.076707 0.101170 0.118864 0.114582 0.123325 0.089011 0.092922 0.083647 0.091406 0.077562 0.089326 0.087072 0.074803 0.145989 0.131498 0.070046 0.068946 0.073623 0.077019 0.097406
qa: -0.1278 -0.3166 -0.3863 0.0119 0.0320 -0.1556 -0.0613 -0.0277 -0.0541 -0.1997 -0.0242 -0.0754 -0.0715 0.2560 -0.1537 -0.2997 -0.2569 -0.0027 -0.1032 -0.1115 -0.2570 0.0923 0.1024 0.0712 0.0556 0.0937 0.0848 0.0767 0.1012 0.1189 0.1146 0.1233 0.0890 0.0929 0.0836 0.0914 0.0776 0.0893 0.0871 0.0748 0.1460 0.1315 0.0700 0.0689 0.0736 0.0770 0.0974
va: 1.1503 1.9555 2.1246 2.9736 3.8844 3.9047 3.7506 3.8991 3.8785 3.8874 3.9370 3.8596 3.8902 4.1296 4.0827 3.9672 3.9381 3.9194 3.9878 3.8411 3.9455 1.0137 1.0118 0.9964 1.0283 1.0070 0.9961 0.9993 0.9998 1.0067 1.0054 1.0040 1.0067 0.9980 1.0005 1.0131 1.0018 1.0066 0.9949 1.0032 1.0056 1.0072 1.0148 1.0041 1.0009 1.0009 1.0098
dispcorr: -0.027746201 hartree
energy: -1328.999448912244
dipole: 12.87749 -12.78481 0.09268 3.20616 -2.60960 0.59656 -22.56656 21.46831 -1.09825
magnitude: 1.25324 au
magnitude: 3.18549 debye
