program: Orca
programVersion: 5.0.2
elementType: Cl O O N C C C C C C C C C C C C C C C C C H H H H H H H H H H H H H H H H H H H H H H H H H H
charge: 0
multiplicity: 1
keywords: wb97x-d3
keywords: def2-TZVPP
keywords: def2/J RIJCOSX
keywords: DEFGRID2
keywords: scfconv7
keywords: smallprint printgap noloewdin
keywords: NOSOSCF
formula: C17H26ClNO2
InChI: InChI=1/C17H26ClNO2/c1-4-11-21-12-10-19(16(20)13-18)17-14(5-2)8-7-9-15(17)6-3/h7-9H,4-6,10-13H2,1-3H3
47 atoms
Cl -2.931461 -2.178563 1.252079
O  2.655346 0.469069 -0.640212
O  0.233071 -2.93159 1.784782
N  0.298011 -1.053798 0.537159
C  -0.276333 0.206098 0.199232
C  -1.22431 0.285646 -0.826868
C  0.092357 1.33649 0.939231
C  1.510275 -1.563839 -0.105386
C  -1.595222 -0.890574 -1.693477
C  1.125551 1.28983 2.033065
C  2.08896 -0.684377 -1.189746
C  -1.84757 1.51014 -1.05489
C  -0.548131 2.53982 0.67249
C  -0.260007 -1.86946 1.474377
C  -1.522914 2.626316 -0.307037
C  -1.321157 -0.64692 -3.176323
C  0.515279 1.295118 3.433512
C  3.494747 1.182195 -1.513622
C  -1.563927 -1.41942 2.117741
C  2.809286 1.761308 -2.744139
C  1.620155 2.65147 -2.420412
H  2.276552 -1.744726 0.652594
H  1.28668 -2.536675 -0.551669
H  -2.656168 -1.109742 -1.556485
H  -1.069085 -1.787342 -1.368481
H  1.775596 0.424949 1.919374
H  1.773499 2.162558 1.925383
H  2.854321 -1.288304 -1.701743
H  1.327186 -0.446819 -1.942572
H  -2.60284 1.585643 -1.827765
H  -0.276932 3.421214 1.241769
H  -2.020376 3.568747 -0.49536
H  -1.904989 0.185926 -3.567995
H  -1.576574 -1.529152 -3.763311
H  -0.270797 -0.417985 -3.359967
H  -0.139004 2.154458 3.584333
H  1.295675 1.33433 4.193455
H  -0.073886 0.397929 3.624638
H  3.913806 1.995502 -0.916597
H  4.33616 0.548481 -1.833198
H  -1.733127 -0.347082 2.109283
H  -1.58295 -1.787859 3.140619
H  3.566915 2.330586 -3.290674
H  2.501656 0.961466 -3.424689
H  0.826546 2.102312 -1.91607
H  1.196589 3.081827 -3.327975
H  1.907921 3.47654 -1.766885
totalener: -1328.96784261 hartree
nucrepener: 2036.34651182 hartree
electener: -3365.31435444 hartree
oneelecener: -5863.84171713 hartree
twoeener: 2498.52736269 hartree
kineticenergy: 1324.30666170 hartree
xcener: -107.429753063731 hartree
chargesum: -0.0000000
charge: -0.130295 -0.303362 -0.378227 -0.002881 0.105737 -0.135770 -0.134611 -0.085421 -0.215663 -0.179948 0.020997 -0.025095 -0.032888 0.269419 -0.176186 -0.239821 -0.247096 -0.003966 -0.114215 -0.111893 -0.185524 0.104925 0.105583 0.097866 0.090136 0.086102 0.078970 0.092511 0.051229 0.107133 0.112323 0.122735 0.079827 0.094517 0.077990 0.081774 0.093089 0.075698 0.080241 0.074221 0.131686 0.149452 0.069778 0.061093 0.023930 0.090045 0.073850
qa: -0.1303 -0.3034 -0.3782 -0.0029 0.1057 -0.1358 -0.1346 -0.0854 -0.2157 -0.1799 0.0210 -0.0251 -0.0329 0.2694 -0.1762 -0.2398 -0.2471 -0.0040 -0.1142 -0.1119 -0.1855 0.1049 0.1056 0.0979 0.0901 0.0861 0.0790 0.0925 0.0512 0.1071 0.1123 0.1227 0.0798 0.0945 0.0780 0.0818 0.0931 0.0757 0.0802 0.0742 0.1317 0.1495 0.0698 0.0611 0.0239 0.0900 0.0739
va: 1.1460 1.9804 2.1434 2.9305 3.5850 3.7742 3.8245 3.8843 3.8843 3.9088 3.9544 3.8220 3.7855 4.1005 4.0294 3.9348 3.9239 3.9435 3.9986 3.8558 3.9341 1.0162 1.0093 1.0089 1.0123 1.0206 1.0056 1.0015 0.9914 1.0081 1.0045 1.0035 1.0068 1.0075 0.9995 1.0040 1.0082 1.0079 0.9965 1.0035 1.0043 1.0012 1.0170 1.0050 1.0073 1.0094 1.0098
dispcorr: -0.031001138 hartree
energy: -1328.998843752145
dipole: 18.08388 -17.58427 0.49961 18.51733 -16.99593 1.52140 -15.43823 14.52430 -0.91393
magnitude: 1.84379 au
magnitude: 4.68653 debye
