program: Orca
programVersion: 5.0.2
elementType: Cl O O N C C C C C C C C C C C C C C C C C H H H H H H H H H H H H H H H H H H H H H H H H H H
charge: 0
multiplicity: 1
keywords: wb97x-d3
keywords: def2-TZVPP
keywords: def2/J RIJCOSX
keywords: DEFGRID2
keywords: scfconv7
keywords: smallprint printgap noloewdin
keywords: NOSOSCF
formula: C17H26ClNO2
InChI: InChI=1/C17H26ClNO2/c1-4-11-21-12-10-19(16(20)13-18)17-14(5-2)8-7-9-15(17)6-3/h7-9H,4-6,10-13H2,1-3H3
47 atoms
Cl -2.122639 -2.46514 1.499266
O  2.688691 0.53158 -0.709722
O  1.173129 -2.350687 0.4392
N  -0.061437 -0.595183 -0.295155
C  -1.076939 0.376967 -0.055474
C  -2.3206 0.225809 -0.684228
C  -0.818391 1.471282 0.783566
C  0.643132 -0.536785 -1.566681
C  -2.651007 -0.928713 -1.593546
C  0.490972 1.665017 1.508339
C  1.668845 0.585795 -1.659471
C  -3.301729 1.182785 -0.454952
C  -1.835754 2.397894 0.991061
C  0.272164 -1.557962 0.608422
C  -3.066759 2.261146 0.377634
C  -2.86811 -0.495595 -3.04255
C  1.153403 3.011264 1.229313
C  3.666013 -0.461026 -0.927558
C  -0.57771 -1.644907 1.867898
C  4.789907 -0.266086 0.068917
C  5.496627 1.075689 -0.060326
H  1.101941 -1.507566 -1.747986
H  -0.086432 -0.377908 -2.364449
H  -3.560616 -1.407557 -1.223543
H  -1.880168 -1.696332 -1.545604
H  0.308617 1.577374 2.584851
H  1.199868 0.881373 1.252247
H  2.074198 0.580579 -2.683487
H  1.165919 1.547585 -1.526307
H  -4.272254 1.067021 -0.922806
H  -1.660579 3.237669 1.652254
H  -3.846595 2.989623 0.557135
H  -3.69503 0.208823 -3.133311
H  -3.097194 -1.354734 -3.673216
H  -1.984396 -0.006852 -3.454863
H  0.535284 3.851516 1.545289
H  1.363815 3.135457 0.167883
H  2.101363 3.081237 1.761902
H  3.243453 -1.464785 -0.812083
H  4.060185 -0.38283 -1.95329
H  -0.818093 -0.681823 2.310373
H  -0.045018 -2.256265 2.590838
H  4.393355 -0.390954 1.079672
H  5.505028 -1.079373 -0.078429
H  4.817201 1.905029 0.128682
H  5.909973 1.208649 -1.061586
H  6.322302 1.154969 0.646837
totalener: -1328.97401610 hartree
nucrepener: 1993.81328094 hartree
electener: -3322.78729704 hartree
oneelecener: -5778.92637602 hartree
twoeener: 2456.13907898 hartree
kineticenergy: 1324.29897579 hartree
xcener: -107.427136163487 hartree
chargesum: -0.0000000
charge: -0.129507 -0.327362 -0.393085 0.049008 0.100028 -0.123054 -0.181808 -0.096129 -0.209729 -0.203934 -0.003318 -0.034827 -0.033185 0.244475 -0.179035 -0.235697 -0.243731 0.011418 -0.062310 -0.111648 -0.237400 0.116628 0.109291 0.092894 0.085362 0.094754 0.094222 0.085391 0.092000 0.112204 0.114970 0.124278 0.077910 0.091351 0.076008 0.080206 0.084210 0.088344 0.098625 0.064777 0.121227 0.142537 0.064084 0.059771 0.083014 0.064254 0.082521
qa: -0.1295 -0.3274 -0.3931 0.0490 0.1000 -0.1231 -0.1818 -0.0961 -0.2097 -0.2039 -0.0033 -0.0348 -0.0332 0.2445 -0.1790 -0.2357 -0.2437 0.0114 -0.0623 -0.1116 -0.2374 0.1166 0.1093 0.0929 0.0854 0.0948 0.0942 0.0854 0.0920 0.1122 0.1150 0.1243 0.0779 0.0914 0.0760 0.0802 0.0842 0.0883 0.0986 0.0648 0.1212 0.1425 0.0641 0.0598 0.0830 0.0643 0.0825
va: 1.1466 1.9491 2.1119 2.9022 3.7057 3.7717 3.7819 3.7817 3.9093 3.8539 3.9089 3.8593 3.8480 4.1658 4.0676 3.9294 3.9429 3.8845 3.9693 3.9413 3.9250 1.0198 1.0155 1.0019 1.0155 0.9938 1.0437 1.0085 0.9921 1.0053 1.0048 1.0028 1.0070 1.0067 1.0066 1.0077 1.0076 1.0077 1.0083 0.9946 1.0117 1.0099 1.0133 1.0137 1.0101 1.0062 1.0065
dispcorr: -0.027899446 hartree
energy: -1329.001915551156
dipole: 20.80765 -21.12435 -0.31670 17.01868 -16.03210 0.98658 -11.55778 11.13293 -0.42485
magnitude: 1.11988 au
magnitude: 2.84651 debye
