program: Orca
programVersion: 5.0.2
elementType: Cl O O N C C C C C C C C C C C C C C C C C H H H H H H H H H H H H H H H H H H H H H H H H H H
charge: 0
multiplicity: 1
keywords: wb97x-d3
keywords: def2-TZVPP
keywords: def2/J RIJCOSX
keywords: DEFGRID2
keywords: scfconv7
keywords: smallprint printgap noloewdin
keywords: NOSOSCF
formula: C17H26ClNO2
InChI: InChI=1/C17H26ClNO2/c1-4-11-21-12-10-19(16(20)13-18)17-14(5-2)8-7-9-15(17)6-3/h7-9H,4-6,10-13H2,1-3H3
47 atoms
Cl -2.394442 -1.521105 2.398291
O  2.353816 -0.242645 -1.532717
O  0.174784 -3.194869 0.889789
N  0.322019 -0.963863 0.557713
C  -0.285277 0.27484 0.200784
C  -0.709475 0.495139 -1.117291
C  -0.392204 1.274595 1.179559
C  1.767653 -0.988248 0.732875
C  -0.629012 -0.543576 -2.209107
C  0.049894 1.041016 2.603501
C  2.552233 -1.219003 -0.550343
C  -1.225692 1.746655 -1.439041
C  -0.904572 2.511848 0.80621
C  -0.368707 -2.12482 0.724571
C  -1.315412 2.750122 -0.493012
C  -1.980593 -0.879562 -2.83681
C  -0.871255 1.646374 3.656832
C  2.933225 1.009347 -1.27069
C  -1.885205 -2.022984 0.759168
C  2.656679 1.93659 -2.438061
C  3.190284 1.426122 -3.768529
H  2.06751 -0.048743 1.199541
H  2.020683 -1.782314 1.435449
H  -0.163061 -1.458324 -1.848332
H  0.041312 -0.170972 -2.986299
H  0.127819 -0.028723 2.792307
H  1.059939 1.444553 2.736863
H  3.617266 -1.303639 -0.283982
H  2.253119 -2.172833 -0.988411
H  -1.547599 1.941231 -2.455083
H  -0.989048 3.301765 1.540838
H  -1.706954 3.720872 -0.767784
H  -2.45123 -0.007541 -3.290907
H  -2.684504 -1.281463 -2.107095
H  -1.858729 -1.628095 -3.61996
H  -0.877893 2.735867 3.635043
H  -0.545582 1.348925 4.653266
H  -1.895182 1.300049 3.521482
H  2.526123 1.462317 -0.355899
H  4.019599 0.902234 -1.121568
H  -2.303031 -3.008228 0.571438
H  -2.303052 -1.305124 0.059988
H  1.579518 2.111776 -2.502288
H  3.107081 2.904481 -2.202454
H  4.268199 1.260041 -3.725927
H  3.000354 2.143928 -4.566659
H  2.723084 0.483846 -4.050638
totalener: -1328.97117821 hartree
nucrepener: 2023.89410111 hartree
electener: -3352.86527931 hartree
oneelecener: -5838.86993114 hartree
twoeener: 2486.00465183 hartree
kineticenergy: 1324.30448470 hartree
xcener: -107.429705092833 hartree
chargesum: 0.0000000
charge: -0.131125 -0.324190 -0.379044 0.035537 0.117827 -0.189390 -0.096006 -0.107336 -0.164234 -0.225378 0.000978 -0.074522 -0.035662 0.244094 -0.158703 -0.227758 -0.247759 0.020248 -0.085219 -0.127275 -0.237371 0.107741 0.108804 0.079295 0.086658 0.099357 0.086068 0.077629 0.103188 0.115916 0.114981 0.125112 0.076433 0.069571 0.093416 0.077028 0.088368 0.087454 0.076931 0.079539 0.147984 0.122066 0.063322 0.067934 0.070137 0.082743 0.084612
qa: -0.1311 -0.3242 -0.3790 0.0355 0.1178 -0.1894 -0.0960 -0.1073 -0.1642 -0.2254 0.0010 -0.0745 -0.0357 0.2441 -0.1587 -0.2278 -0.2478 0.0202 -0.0852 -0.1273 -0.2374 0.1077 0.1088 0.0793 0.0867 0.0994 0.0861 0.0776 0.1032 0.1159 0.1150 0.1251 0.0764 0.0696 0.0934 0.0770 0.0884 0.0875 0.0769 0.0795 0.1480 0.1221 0.0633 0.0679 0.0701 0.0827 0.0846
va: 1.1501 1.9518 2.1278 2.8903 3.6240 3.7460 3.7279 3.8101 3.9163 3.8839 3.8972 3.8229 3.8472 4.1500 4.0507 3.9190 3.9338 3.9050 3.9737 3.9382 3.9321 0.9884 1.0379 1.0132 1.0069 1.0123 0.9976 1.0081 1.0069 1.0040 1.0040 1.0018 1.0083 1.0112 1.0062 1.0035 1.0069 1.0169 0.9864 0.9984 1.0052 1.0215 1.0134 1.0143 1.0060 1.0059 1.0120
dispcorr: -0.029647018 hartree
energy: -1329.000825227429
dipole: 15.21254 -14.91058 0.30195 14.74822 -13.42925 1.31897 -17.20006 16.70607 -0.49399
magnitude: 1.44044 au
magnitude: 3.66132 debye
