program: Orca
programVersion: 5.0.2
elementType: Cl O O N C C C C C C C C C C C C C C C C C H H H H H H H H H H H H H H H H H H H H H H H H H H
charge: 0
multiplicity: 1
keywords: wb97x-d3
keywords: def2-TZVPP
keywords: def2/J RIJCOSX
keywords: DEFGRID2
keywords: scfconv7
keywords: smallprint printgap noloewdin
keywords: NOSOSCF
formula: C17H26ClNO2
InChI: InChI=1/C17H26ClNO2/c1-4-11-21-12-10-19(16(20)13-18)17-14(5-2)8-7-9-15(17)6-3/h7-9H,4-6,10-13H2,1-3H3
47 atoms
Cl -1.941045 -1.590862 2.731572
O  3.335882 0.612038 -1.01387
O  1.049737 -2.355716 1.073964
N  0.156159 -0.354981 0.521889
C  -0.984558 0.437246 0.205925
C  -1.65314 0.251201 -1.012456
C  -1.41251 1.404711 1.124497
C  1.477218 0.239845 0.380378
C  -1.228302 -0.768921 -2.040664
C  -0.716556 1.653983 2.436269
C  2.054849 0.049007 -1.012586
C  -2.77697 1.02781 -1.276384
C  -2.529431 2.169112 0.810478
C  0.07355 -1.657522 0.913813
C  -3.215018 1.9801 -0.375379
C  -0.936763 -0.162433 -3.411435
C  -0.007898 3.006868 2.481304
C  3.88963 0.801986 -2.289967
C  -1.31645 -2.215162 1.179028
C  4.158272 -0.482573 -3.061926
C  5.024584 -1.475668 -2.302331
H  1.400214 1.305467 0.595309
H  2.14841 -0.200504 1.117206
H  -2.019943 -1.51747 -2.147589
H  -0.347777 -1.315226 -1.705946
H  -1.462524 1.614767 3.233528
H  -0.008942 0.856849 2.659077
H  2.075849 -1.021319 -1.25624
H  1.408137 0.543505 -1.753197
H  -3.32011 0.879858 -2.201913
H  -2.877677 2.910549 1.519794
H  -4.093501 2.572101 -0.595825
H  -0.603202 -0.93167 -4.107753
H  -0.156222 0.595778 -3.350952
H  -1.817024 0.310856 -3.845216
H  0.479663 3.153668 3.445013
H  -0.705366 3.831768 2.3349
H  0.756638 3.088865 1.708524
H  3.245472 1.460464 -2.892736
H  4.830365 1.334036 -2.127608
H  -1.235271 -3.295073 1.265629
H  -2.043669 -1.96486 0.410506
H  3.216156 -0.956262 -3.3539
H  4.645955 -0.201062 -3.999551
H  4.552311 -1.796357 -1.374509
H  5.99081 -1.040473 -2.04268
H  5.214503 -2.36649 -2.900476
totalener: -1328.97104054 hartree
nucrepener: 1958.73682538 hartree
electener: -3287.70786592 hartree
oneelecener: -5708.38615507 hartree
twoeener: 2420.67828915 hartree
kineticenergy: 1324.31003024 hartree
xcener: -107.427347297720 hartree
chargesum: 0.0000000
charge: -0.126803 -0.328082 -0.374001 -0.011390 0.139335 -0.170148 -0.133833 0.000323 -0.231669 -0.208985 -0.019180 -0.038005 -0.027104 0.226992 -0.179610 -0.242459 -0.231968 0.005597 -0.062890 -0.123193 -0.239241 0.101614 0.108972 0.098496 0.093516 0.093094 0.086331 0.084339 0.063457 0.112702 0.113035 0.124789 0.091547 0.082691 0.081943 0.090500 0.075810 0.080940 0.070513 0.087440 0.143025 0.118413 0.059587 0.069644 0.089803 0.071080 0.083034
qa: -0.1268 -0.3281 -0.3740 -0.0114 0.1393 -0.1701 -0.1338 0.0003 -0.2317 -0.2090 -0.0192 -0.0380 -0.0271 0.2270 -0.1796 -0.2425 -0.2320 0.0056 -0.0629 -0.1232 -0.2392 0.1016 0.1090 0.0985 0.0935 0.0931 0.0863 0.0843 0.0635 0.1127 0.1130 0.1248 0.0915 0.0827 0.0819 0.0905 0.0758 0.0809 0.0705 0.0874 0.1430 0.1184 0.0596 0.0696 0.0898 0.0711 0.0830
va: 1.1480 1.9927 2.1321 2.9186 3.7025 3.7481 3.7993 3.7807 3.9090 3.9157 3.9501 3.8572 3.8498 4.1930 4.0670 3.9234 3.9287 3.9492 3.9696 3.8579 3.9424 1.0187 1.0284 0.9947 1.0127 1.0011 1.0179 0.9886 0.9988 1.0054 1.0047 1.0026 1.0066 1.0096 1.0083 1.0071 1.0064 1.0065 1.0013 0.9955 1.0098 1.0105 1.0032 1.0136 1.0086 1.0049 1.0054
dispcorr: -0.026577990 hartree
energy: -1328.997618527393
dipole: 19.14120 -19.88117 -0.73997 9.93073 -9.11817 0.81256 -23.44760 22.21670 -1.23091
magnitude: 1.65013 au
magnitude: 4.19430 debye
