program: Orca
programVersion: 5.0.2
elementType: Cl O O N C C C C C C C C C C C C C C C C C H H H H H H H H H H H H H H H H H H H H H H H H H H
charge: 0
multiplicity: 1
keywords: wb97x-d3
keywords: def2-TZVPP
keywords: def2/J RIJCOSX
keywords: DEFGRID2
keywords: scfconv7
keywords: smallprint printgap noloewdin
keywords: NOSOSCF
formula: C17H26ClNO2
InChI: InChI=1/C17H26ClNO2/c1-4-11-21-12-10-19(16(20)13-18)17-14(5-2)8-7-9-15(17)6-3/h7-9H,4-6,10-13H2,1-3H3
47 atoms
Cl -0.494641 -2.636929 1.446835
O  2.030292 -0.035074 -1.943969
O  1.743691 -0.313126 2.046386
N  0.394126 0.602354 0.482767
C  -0.932048 0.984949 0.108471
C  -1.641532 0.256027 -0.851695
C  -1.498332 2.110144 0.727149
C  1.521254 1.351604 -0.070616
C  -1.074276 -0.929416 -1.583326
C  -0.782973 2.906789 1.788701
C  2.57459 0.523594 -0.782607
C  -2.942812 0.655494 -1.15005
C  -2.791489 2.482445 0.38418
C  0.639909 -0.194407 1.559837
C  -3.517855 1.754213 -0.54221
C  -0.930744 -0.667105 -3.080216
C  -1.130545 2.453737 3.205701
C  2.945705 -0.740748 -2.742271
C  -0.527874 -0.985739 2.13115
C  3.457124 -2.040665 -2.13452
C  2.348518 -2.990573 -1.70607
H  1.110943 2.084024 -0.765639
H  2.026913 1.903164 0.727007
H  -1.730477 -1.788284 -1.421656
H  -0.106115 -1.203893 -1.177664
H  0.298049 2.874155 1.655427
H  -1.063432 3.957109 1.677899
H  3.404643 1.204295 -1.030481
H  2.978032 -0.234954 -0.106054
H  -3.511657 0.08727 -1.876123
H  -3.234855 3.351115 0.856845
H  -4.52937 2.047003 -0.791679
H  -1.891676 -0.465422 -3.555264
H  -0.495024 -1.53507 -3.576831
H  -0.278829 0.184876 -3.263323
H  -0.808976 1.429483 3.395531
H  -2.205624 2.500174 3.382993
H  -0.64056 3.086564 3.945831
H  2.412893 -0.962571 -3.670663
H  3.799642 -0.098563 -3.007171
H  -1.508197 -0.565489 1.926018
H  -0.38487 -1.077612 3.205226
H  4.085037 -2.518731 -2.892287
H  4.121096 -1.839228 -1.289266
H  1.649594 -3.180271 -2.523484
H  1.774713 -2.597005 -0.867304
H  2.756916 -3.951585 -1.39386
totalener: -1328.97067842 hartree
nucrepener: 2014.01645462 hartree
electener: -3342.98713304 hartree
oneelecener: -5819.46931960 hartree
twoeener: 2476.48218656 hartree
kineticenergy: 1324.29441232 hartree
xcener: -107.423241533842 hartree
chargesum: -0.0000000
charge: -0.124574 -0.308737 -0.383021 0.019954 -0.015900 -0.050250 -0.065371 -0.074531 -0.094485 -0.192409 -0.028994 -0.064848 -0.057039 0.236033 -0.152880 -0.265548 -0.246557 -0.014624 -0.107150 -0.102791 -0.230771 0.109940 0.094512 0.094463 -0.001961 0.096582 0.084180 0.073100 0.107921 0.114505 0.112310 0.125112 0.082270 0.077317 0.088966 0.078288 0.085410 0.093712 0.082484 0.078434 0.135678 0.147156 0.065654 0.064476 0.068412 0.070018 0.095552
qa: -0.1246 -0.3087 -0.3830 0.0200 -0.0159 -0.0502 -0.0654 -0.0745 -0.0945 -0.1924 -0.0290 -0.0648 -0.0570 0.2360 -0.1529 -0.2655 -0.2466 -0.0146 -0.1072 -0.1028 -0.2308 0.1099 0.0945 0.0945 -0.0020 0.0966 0.0842 0.0731 0.1079 0.1145 0.1123 0.1251 0.0823 0.0773 0.0890 0.0783 0.0854 0.0937 0.0825 0.0784 0.1357 0.1472 0.0657 0.0645 0.0684 0.0700 0.0956
va: 1.1469 1.9545 2.1294 2.9183 3.7562 3.8759 3.8791 3.9451 3.8108 3.9183 3.9466 3.8654 3.8807 4.1267 4.0225 3.9349 3.9130 3.9300 3.9738 3.8450 3.9343 1.0039 1.0115 1.0077 1.0761 1.0059 1.0038 1.0002 0.9978 1.0052 1.0063 1.0018 1.0137 1.0068 1.0148 1.0106 1.0030 1.0096 0.9923 1.0058 1.0016 1.0034 1.0160 1.0069 1.0048 1.0110 1.0092
dispcorr: -0.029609083 hartree
energy: -1329.000287499043
dipole: 7.88351 -8.34602 -0.46252 6.40727 -5.45950 0.94777 -12.88294 12.41345 -0.46949
magnitude: 1.15438 au
magnitude: 2.93421 debye
