program: Orca
programVersion: 5.0.2
elementType: Cl O O N C C C C C C C C C C C C C C C C C H H H H H H H H H H H H H H H H H H H H H H H H H H
charge: 0
multiplicity: 1
keywords: wb97x-d3
keywords: def2-TZVPP
keywords: def2/J RIJCOSX
keywords: DEFGRID2
keywords: scfconv7
keywords: smallprint printgap noloewdin
keywords: NOSOSCF
formula: C17H26ClNO2
InChI: InChI=1/C17H26ClNO2/c1-4-11-21-12-10-19(16(20)13-18)17-14(5-2)8-7-9-15(17)6-3/h7-9H,4-6,10-13H2,1-3H3
47 atoms
Cl -2.383605 -1.586022 2.43326
O  2.256787 0.294737 -1.451937
O  0.399189 -2.843033 0.958863
N  0.206422 -0.630337 0.53588
C  -0.591813 0.48155 0.139368
C  -1.022782 0.590393 -1.188611
C  -0.902108 1.463081 1.091574
C  1.637623 -0.434545 0.721635
C  -0.716166 -0.436071 -2.250052
C  -0.421392 1.359279 2.517937
C  2.486484 -0.709689 -0.502608
C  -1.773482 1.705214 -1.54732
C  -1.650131 2.561885 0.684555
C  -0.30041 -1.875364 0.751814
C  -2.08333 2.684932 -0.623662
C  -1.960696 -1.085686 -2.852113
C  -1.413199 1.860253 3.560588
C  2.88165 0.083752 -2.69164
C  -1.814768 -2.006207 0.790969
C  4.395585 0.252003 -2.665866
C  4.838238 1.608262 -2.137096
H  1.800713 0.596417 1.039267
H  1.974347 -1.083194 1.53053
H  -0.058094 -1.212863 -1.865463
H  -0.153644 0.055076 -3.047836
H  -0.176688 0.323018 2.747314
H  0.515721 1.917889 2.617382
H  3.537451 -0.731578 -0.179212
H  2.258675 -1.706515 -0.905232
H  -2.108178 1.811639 -2.572333
H  -1.902701 3.333937 1.398971
H  -2.662394 3.548789 -0.922895
H  -2.621941 -0.353584 -3.315103
H  -2.545604 -1.62071 -2.103755
H  -1.680815 -1.805506 -3.621448
H  -1.037557 1.655444 4.562764
H  -2.374717 1.359173 3.454892
H  -1.583771 2.934701 3.49809
H  2.626757 -0.910589 -3.088576
H  2.448225 0.822037 -3.371759
H  -2.078634 -3.04396 0.60556
H  -2.341311 -1.359869 0.09544
H  4.860184 -0.547662 -2.082055
H  4.756748 0.1142 -3.688955
H  4.422629 2.420518 -2.735762
H  5.923509 1.70503 -2.159073
H  4.512582 1.76481 -1.109129
totalener: -1328.97113818 hartree
nucrepener: 1984.51398597 hartree
electener: -3313.48512414 hartree
oneelecener: -5760.27859298 hartree
twoeener: 2446.79346884 hartree
kineticenergy: 1324.30268132 hartree
xcener: -107.426838251959 hartree
chargesum: -0.0000000
charge: -0.129492 -0.313681 -0.382453 -0.002921 0.123499 -0.152595 -0.070578 -0.035219 -0.224397 -0.227489 -0.034611 -0.046565 -0.048095 0.258481 -0.171791 -0.222427 -0.249246 0.003340 -0.099940 -0.128486 -0.234149 0.101315 0.104600 0.082093 0.091585 0.096601 0.086634 0.082000 0.098225 0.112814 0.114121 0.123684 0.078816 0.070089 0.090350 0.088594 0.087442 0.077312 0.079078 0.082905 0.147202 0.124188 0.062402 0.068104 0.071572 0.085421 0.081667
qa: -0.1295 -0.3137 -0.3825 -0.0029 0.1235 -0.1526 -0.0706 -0.0352 -0.2244 -0.2275 -0.0346 -0.0466 -0.0481 0.2585 -0.1718 -0.2224 -0.2492 0.0033 -0.0999 -0.1285 -0.2341 0.1013 0.1046 0.0821 0.0916 0.0966 0.0866 0.0820 0.0982 0.1128 0.1141 0.1237 0.0788 0.0701 0.0904 0.0886 0.0874 0.0773 0.0791 0.0829 0.1472 0.1242 0.0624 0.0681 0.0716 0.0854 0.0817
va: 1.1516 1.9490 2.1248 2.9436 3.7846 3.7712 3.7758 3.8874 3.9411 3.8937 3.9437 3.8601 3.8585 4.1275 4.0683 3.9153 3.9348 3.9134 3.9806 3.9208 3.9311 1.0074 1.0222 1.0065 0.9999 1.0111 0.9966 0.9953 1.0031 1.0033 1.0057 1.0030 1.0075 1.0117 1.0074 1.0067 1.0165 1.0027 0.9994 0.9915 1.0048 1.0170 1.0043 1.0150 1.0051 1.0065 1.0100
dispcorr: -0.027547504 hartree
energy: -1328.998685682514
dipole: 18.80856 -18.51722 0.29134 11.34110 -10.44874 0.89236 -17.25681 16.25497 -1.00183
magnitude: 1.37290 au
magnitude: 3.48963 debye
