program: Orca
programVersion: 5.0.2
elementType: Cl O O N C C C C C C C C C C C C C C C C C H H H H H H H H H H H H H H H H H H H H H H H H H H
charge: 0
multiplicity: 1
keywords: wb97x-d3
keywords: def2-TZVPP
keywords: def2/J RIJCOSX
keywords: DEFGRID2
keywords: scfconv7
keywords: smallprint printgap noloewdin
keywords: NOSOSCF
formula: C17H26ClNO2
InChI: InChI=1/C17H26ClNO2/c1-4-11-21-12-10-19(16(20)13-18)17-14(5-2)8-7-9-15(17)6-3/h7-9H,4-6,10-13H2,1-3H3
47 atoms
Cl -1.02825 -0.964464 3.239439
O  2.324937 -0.301419 -1.655003
O  1.931964 -0.625486 1.701948
N  0.393867 0.343578 0.35471
C  -0.990469 0.593667 0.103987
C  -1.634424 -0.05119 -0.958751
C  -1.674573 1.502889 0.920324
C  1.350624 1.309171 -0.175443
C  -0.930602 -1.006901 -1.883082
C  -1.012805 2.264433 2.038471
C  2.627858 0.736669 -0.769975
C  -2.982313 0.213448 -1.175597
C  -3.02147 1.738575 0.666609
C  0.799824 -0.571032 1.275276
C  -3.675693 1.098243 -0.369681
C  -0.614203 -0.370933 -3.234761
C  -0.760503 3.725461 1.669111
C  3.460458 -0.883525 -2.239554
C  -0.243338 -1.570202 1.753897
C  3.068449 -2.154662 -2.96676
C  2.55522 -3.249673 -2.042032
H  0.817263 1.867943 -0.94441
H  1.644091 2.029003 0.596469
H  -1.568517 -1.881078 -2.037797
H  -0.003701 -1.36499 -1.440654
H  -1.657704 2.221809 2.918695
H  -0.077159 1.79679 2.341106
H  3.131134 1.569027 -1.287946
H  3.303839 0.393878 0.017823
H  -3.493687 -0.291877 -1.986636
H  -3.564223 2.428071 1.302579
H  -4.727114 1.284307 -0.545737
H  -0.128772 -1.090498 -3.89443
H  0.060489 0.47533 -3.119882
H  -1.51852 -0.017713 -3.731161
H  -0.111736 3.81186 0.797143
H  -0.284086 4.255999 2.493727
H  -1.690269 4.243796 1.433635
H  3.936612 -0.180112 -2.939076
H  4.210136 -1.120134 -1.469236
H  0.269515 -2.493809 2.010813
H  -1.026655 -1.775628 1.029026
H  2.321086 -1.91999 -3.729402
H  3.950582 -2.511632 -3.504664
H  2.333781 -4.160808 -2.59765
H  1.644415 -2.946947 -1.527799
H  3.294577 -3.499676 -1.279606
totalener: -1328.97123866 hartree
nucrepener: 2002.35808614 hartree
electener: -3331.32932481 hartree
oneelecener: -5796.15160545 hartree
twoeener: 2464.82228064 hartree
kineticenergy: 1324.31092795 hartree
xcener: -107.424759778593 hartree
chargesum: -0.0000000
charge: -0.126685 -0.319730 -0.389381 0.017865 0.086301 -0.088108 -0.135658 -0.113579 -0.087462 -0.198315 0.004769 -0.047065 -0.054383 0.228345 -0.163201 -0.258297 -0.244660 0.026108 -0.075901 -0.131637 -0.239844 0.112100 0.097048 0.090750 0.007516 0.091485 0.085432 0.075679 0.108964 0.113793 0.113430 0.124150 0.082034 0.083642 0.086686 0.077563 0.092129 0.079731 0.073440 0.066633 0.142078 0.124225 0.062572 0.071575 0.085725 0.084372 0.077765
qa: -0.1267 -0.3197 -0.3894 0.0179 0.0863 -0.0881 -0.1357 -0.1136 -0.0875 -0.1983 0.0048 -0.0471 -0.0544 0.2283 -0.1632 -0.2583 -0.2447 0.0261 -0.0759 -0.1316 -0.2398 0.1121 0.0970 0.0908 0.0075 0.0915 0.0854 0.0757 0.1090 0.1138 0.1134 0.1241 0.0820 0.0836 0.0867 0.0776 0.0921 0.0797 0.0734 0.0666 0.1421 0.1242 0.0626 0.0716 0.0857 0.0844 0.0778
va: 1.1483 1.9727 2.1166 2.8863 3.6134 3.8492 3.7898 3.9590 3.8226 3.8887 3.9167 3.8560 3.8927 4.1986 4.0457 3.9316 3.9253 3.9121 3.9826 3.9427 3.9322 0.9866 1.0060 1.0006 1.0717 1.0042 1.0162 0.9935 1.0129 1.0046 1.0043 1.0018 1.0055 1.0144 1.0115 1.0035 1.0058 1.0073 0.9960 0.9944 1.0079 1.0095 1.0107 1.0141 1.0059 0.9963 1.0069
dispcorr: -0.028720450 hartree
energy: -1328.999959114507
dipole: 11.51958 -11.82437 -0.30479 2.56927 -2.18303 0.38624 -24.91847 23.75633 -1.16213
magnitude: 1.26199 au
magnitude: 3.20773 debye
