program: Gaussian 09
title: 000056237
version: EM64L-G09RevD.01
frameworkgroup: C1[X(C16H15ClO6)]
method: RPBEPBE
basis: SDD
operation: Freq
keyword: #p
keyword: freq=noraman
keyword: PBEPBE/SDD
title: #p freq=noraman PBEPBE/SDD
converged: YES YES NO NO
title: Mulliken charges:
elementType: Cl O O O O O O C C C C C C C C C C C C C C C C H H H H H H H H H H H H H H H
charge: -0.058423 -0.285134 -0.285167 -0.276795 -0.277538 -0.193864 -0.193757 0.385973 0.414044 -0.054919 -0.041189 0.104483 0.102420 -0.377327 -0.406654 -0.115782 -0.235636 0.276332 0.275484 -0.525703 -0.525798 -0.749190 -0.749657 0.292352 0.274075 0.259644 0.264890 0.232438 0.231658 0.264851 0.232072 0.231322 0.251737 0.248516 0.255395 0.250283 0.248523 0.256043
chargesum: 0.00000
title: Mulliken charges with hydrogens summed into heavy atoms:
elementType: Cl O O O O O O C C C C C C C C C C C C C C C C
charge: -0.058423 -0.285134 -0.285167 -0.276795 -0.277538 -0.193864 -0.193757 0.385973 0.414044 -0.054919 -0.041189 0.104483 0.102420 -0.084974 -0.132580 -0.115782 0.024007 0.276332 0.275484 0.203284 0.202446 0.006458 0.005192
polarizability: 2.79188017e+02 2.19556500e+01 2.56243232e+02 -6.80388278e+00 7.61599269e+00 1.24851964e+02
1716.lowfreq: -4.2604 -0.0016 0.0012 0.0018 3.9512 7.5810 39.2612 43.0433 47.2726
frequency: 39.2472 43.0321 47.2664 58.3873 61.9901 65.9435 76.0690 82.6783 90.0222 92.4257 99.9609 113.8533 128.9637 146.8790 161.4618 167.8772 191.1344 204.5040 245.5526 251.5538 266.8759 279.1631 308.1984 318.7935 319.5392 366.5409 377.0411 391.8456 430.2720 445.5248 476.9686 499.3027 518.4329 541.6711 547.2134 560.6702 589.7001 613.5828 651.1786 666.8472 695.6848 704.0947 737.0166 789.8902 799.9754 820.1554 847.1743 878.8407 886.4283 897.2131 919.6429 971.5984 984.9678 985.6510 995.5959 1011.2830 1037.2542 1038.6687 1062.3836 1075.6092 1105.0221 1112.5963 1115.1279 1144.7245 1152.9281 1156.8911 1163.2359 1176.6920 1255.7173 1292.0028 1329.8867 1377.7098 1382.8830 1383.6371 1402.2983 1411.0394 1425.1014 1442.1541 1447.0314 1452.4169 1452.5379 1453.0008 1453.4537 1459.3070 1462.4836 1475.7878 1482.3434 1492.3848 1571.6034 1591.9338 1629.6637 1696.9166 1697.7216 2983.6270 2985.5534 3008.4285 3009.0952 3086.8364 3089.0346 3099.0388 3099.3867 3130.5650 3131.4262 3143.7413 3144.5377 3160.7778 3180.2191 3183.6807
redmass: 4.7662 6.9146 7.7639 2.4796 2.4281 4.9413 4.1975 1.5770 1.2671 2.5460 2.7468 4.2607 5.7484 2.5863 1.2352 1.3004 6.0080 4.3736 5.9423 5.6510 4.5734 7.0044 6.3703 7.5131 7.2428 5.7619 4.5642 5.1050 5.1406 7.0523 5.0330 4.6836 5.7143 3.4540 3.2424 5.0086 4.5899 7.1401 7.0599 8.1704 8.2692 7.6064 4.6833 6.2595 4.6218 1.7270 7.1482 2.0109 7.1752 8.7531 2.9293 1.3910 2.2430 2.1321 7.8588 7.8790 1.6546 1.6512 3.0540 3.7938 2.6934 1.2701 1.2732 1.9720 1.3691 1.6175 3.1204 1.9075 1.4551 5.2188 3.8357 2.9682 1.3167 1.2418 4.2516 2.7646 1.8303 1.7309 2.1867 1.0537 1.0575 1.0524 1.0741 1.0632 1.1112 1.0557 1.0563 4.6423 9.3756 7.9397 8.6902 10.7044 10.6611 1.0298 1.0299 1.0375 1.0373 1.1047 1.1047 1.0958 1.0960 1.1040 1.1040 1.1018 1.1017 1.0877 1.0968 1.0935
irintensity: 1.6671 0.1345 0.2634 5.2667 0.9680 1.8405 0.5743 1.8014 0.2100 1.2183 10.0798 3.0755 2.0175 1.0475 0.3283 0.4220 1.4395 3.7936 0.4542 5.9689 6.2607 0.7318 1.0261 14.7375 2.2542 2.2013 1.3852 3.1540 4.7586 1.9000 17.1196 2.0506 12.7880 22.2881 4.3994 29.9207 6.4754 14.3561 2.5726 0.2768 4.2067 56.2419 5.1788 28.3510 82.3170 10.9323 2.7913 22.2368 72.4281 94.3859 4.0310 1.5113 106.4809 79.8683 136.3072 287.7008 7.7072 9.8244 6.3400 50.4207 62.3332 6.2527 8.2540 516.8115 1.7493 160.6550 100.7098 104.6528 10.9137 162.9151 81.6197 50.5711 62.2703 53.4854 65.9795 43.3785 6.8027 41.9805 19.5343 2.5321 37.8900 6.7444 18.3630 13.9904 2.1320 4.4836 24.4538 53.2408 9.0411 50.8220 19.2806 225.5746 99.1007 67.9687 56.6560 1.4975 1.3931 20.1196 16.3927 6.3236 5.9095 17.8880 19.7436 9.8936 9.5525 0.2354 2.9313 2.8349
temp: 298.150 k
press: 1.00000 atm
elementType: 17 8 8 8 8 8 8 6 6 6 6 6 6 6 6 6 6 6 6 6 6 6 6 1 1 1 1 1 1 1 1 1 1 1 1 1 1 1
symmnumber: 1
zpe: 728295.4 jmol-1
zpe.correction: 0.277393 hartree
zpe.thermalcorrener: 0.301334 hartree
zpe.thermalcorrenthalpy: 0.302278 hartree
zpe.thermalcorrgfe: 0.222325 hartree
zpe.sumelectzpe: -1528.403311 hartree
zpe.sumelectthermal: -1528.379370 hartree
zpe.sumelectthermalent: -1528.378426 hartree
zpe.sumelectthermalfe: -1528.458379 hartree
dipole: 2.5769 1.3099 -0.0987
dipole: 2.8925
quadrupole: -129.1122 -120.3718 -146.3157
quadrupole: -9.1973 -11.1402 11.6284
quadrupole: 2.8210 11.5615 -14.3825 -9.1973 -11.1402 11.6284
hfenergy: -1528.6807041 hartree
pointgroup: C01 [X(C16H15Cl1O6)]
dipole: 0.6284567 -0.9483215 0.0269762 debye
polarizability: 255.1560171|-21.0076535|280.6928632|6.5888663|3.2249294|124.4343331 unknown
InChI: InChI=1S/C16H15ClO6/c1-8(18)22-13-11-6-5-10(17)7-12(11)14(23-9(2)19)16(21-4)15(13)20-3/h5-7H,1-4H3
charge 0 multiplicity 1
38 atoms
Cl -2.655947 4.789908 -0.061767
O  -2.655073 -0.613429 -0.454645
O  2.790949 0.615029 0.486244
O  -0.776239 -2.672383 -0.300801
O  1.99724 -2.048238 0.228993
O  -2.942533 -1.697697 1.613866
O  3.499369 -0.143378 -1.625473
C  -0.912595 1.059971 -0.04024
C  0.489866 1.378631 0.124071
C  -1.294839 -0.312548 -0.175214
C  1.431965 0.305514 0.206891
C  -0.350472 -1.344211 -0.133971
C  1.033365 -1.032144 0.113624
C  -1.875075 2.118933 -0.096298
C  0.883884 2.751199 0.228031
C  -1.437465 3.433962 0.009499
C  -0.063441 3.774842 0.172303
C  -3.382551 -1.411251 0.491245
C  3.782572 0.252309 -0.485546
C  -0.220992 -3.340425 -1.510959
C  1.80299 -2.934747 1.410138
C  -4.709949 -1.796719 -0.113013
C  5.152535 0.446636 0.115908
H  -2.931869 1.87813 -0.230098
H  1.943189 2.98699 0.360139
H  0.23374 4.823956 0.250933
H  0.882339 -3.322897 -1.492515
H  -0.596068 -2.835505 -2.419662
H  -0.596017 -4.373616 -1.465955
H  0.799539 -3.393835 1.389589
H  1.9377 -2.351658 2.339275
H  2.585534 -3.703269 1.324919
H  -5.177024 -0.932121 -0.612416
H  -5.374102 -2.194174 0.667819
H  -4.5471 -2.573957 -0.881196
H  5.19983 1.388709 0.685953
H  5.913335 0.438177 -0.677876
H  5.35821 -0.378295 0.821702
