program: Orca
programVersion: 5.0.2
elementType: Cl O O N C C C C C C C C C C C C C C C C C H H H H H H H H H H H H H H H H H H H H H H H H H H
charge: 0
multiplicity: 1
keywords: wb97x-d3
keywords: def2-TZVPP
keywords: def2/J RIJCOSX
keywords: DEFGRID2
keywords: scfconv7
keywords: smallprint printgap noloewdin
keywords: NOSOSCF
formula: C17H26ClNO2
InChI: InChI=1/C17H26ClNO2/c1-4-11-21-12-10-19(16(20)13-18)17-14(5-2)8-7-9-15(17)6-3/h7-9H,4-6,10-13H2,1-3H3
47 atoms
Cl -2.569994 -2.237463 1.320018
O  2.375224 0.707691 -1.252187
O  0.750615 -2.790224 0.585356
N  0.00121 -0.84862 -0.291214
C  -0.799191 0.327254 -0.196989
C  -1.971715 0.39975 -0.964431
C  -0.391077 1.39213 0.615118
C  0.798411 -1.055468 -1.494457
C  -2.40365 -0.742013 -1.851087
C  0.859975 1.363929 1.457449
C  2.261558 -0.684941 -1.360607
C  -2.722604 1.567378 -0.91161
C  -1.179679 2.538844 0.639562
C  0.022051 -1.823635 0.656822
C  -2.330972 2.631075 -0.117873
C  -3.911407 -0.933157 -1.957888
C  0.610325 1.628665 2.940698
C  3.689215 1.197447 -1.29352
C  -0.946293 -1.68278 1.820537
C  4.516368 0.917856 -0.045834
C  5.890622 1.566024 -0.140004
H  0.733491 -2.105158 -1.784263
H  0.356127 -0.464588 -2.296984
H  -1.965246 -1.671598 -1.490264
H  -1.991028 -0.587776 -2.854251
H  1.384655 0.417396 1.344146
H  1.547384 2.120201 1.071374
H  2.698452 -1.210695 -0.504033
H  2.785221 -1.048193 -2.259061
H  -3.630033 1.649619 -1.494568
H  -0.876887 3.378572 1.253038
H  -2.926377 3.534324 -0.091364
H  -4.405137 -0.109769 -2.473556
H  -4.362648 -1.03213 -0.971151
H  -4.133909 -1.839575 -2.520272
H  1.545315 1.575813 3.498905
H  -0.073034 0.899333 3.377437
H  0.182996 2.615254 3.118001
H  4.219768 0.805384 -2.175943
H  3.603304 2.278321 -1.433886
H  -1.052988 -0.666135 2.187199
H  -0.609941 -2.331364 2.624832
H  3.984369 1.295861 0.831155
H  4.634574 -0.15845 0.103362
H  5.814476 2.649178 -0.248838
H  6.452223 1.189356 -0.996584
H  6.484341 1.367688 0.751397
totalener: -1328.97103150 hartree
nucrepener: 1980.81980794 hartree
electener: -3309.79083944 hartree
oneelecener: -5752.91430527 hartree
twoeener: 2443.12346583 hartree
kineticenergy: 1324.29957936 hartree
xcener: -107.427064935096 hartree
chargesum: 0.0000000
charge: -0.131403 -0.307322 -0.385491 0.002871 0.111956 -0.087964 -0.130364 -0.031773 -0.211486 -0.245106 -0.024383 -0.049026 -0.046342 0.240164 -0.172666 -0.253788 -0.221859 -0.004226 -0.066150 -0.090695 -0.257191 0.103886 0.096076 0.096163 0.085359 0.090469 0.091287 0.098234 0.077513 0.114855 0.113664 0.123059 0.077122 0.090075 0.088722 0.089915 0.071231 0.078159 0.065698 0.087511 0.114598 0.145769 0.058091 0.062530 0.075209 0.078198 0.088851
qa: -0.1314 -0.3073 -0.3855 0.0029 0.1120 -0.0880 -0.1304 -0.0318 -0.2115 -0.2451 -0.0244 -0.0490 -0.0463 0.2402 -0.1727 -0.2538 -0.2219 -0.0042 -0.0661 -0.0907 -0.2572 0.1039 0.0961 0.0962 0.0854 0.0905 0.0913 0.0982 0.0775 0.1149 0.1137 0.1231 0.0771 0.0901 0.0887 0.0899 0.0712 0.0782 0.0657 0.0875 0.1146 0.1458 0.0581 0.0625 0.0752 0.0782 0.0889
va: 1.1498 1.9843 2.1212 2.9492 3.8000 3.7662 3.7652 3.8879 3.8952 3.9590 3.9428 3.8584 3.8539 4.1514 4.0702 3.9396 3.9142 3.9302 3.9766 3.8476 3.9674 1.0184 1.0117 1.0081 0.9966 0.9946 1.0004 0.9969 1.0033 1.0051 1.0035 1.0033 1.0015 1.0130 1.0069 1.0064 1.0101 1.0078 1.0023 0.9999 1.0266 1.0067 1.0084 1.0111 1.0044 1.0043 1.0038
dispcorr: -0.027314158 hartree
energy: -1328.998345654802
dipole: 22.38223 -21.89665 0.48558 15.37061 -14.18792 1.18270 -5.16168 4.91224 -0.24944
magnitude: 1.30260 au
magnitude: 3.31095 debye
