program: Orca
programVersion: 5.0.2
elementType: Cl O O N C C C C C C C C C C C C C C C C C H H H H H H H H H H H H H H H H H H H H H H H H H H
charge: 0
multiplicity: 1
keywords: wb97x-d3
keywords: def2-TZVPP
keywords: def2/J RIJCOSX
keywords: DEFGRID2
keywords: scfconv7
keywords: smallprint printgap noloewdin
keywords: NOSOSCF
formula: C17H26ClNO2
InChI: InChI=1/C17H26ClNO2/c1-4-11-21-12-10-19(16(20)13-18)17-14(5-2)8-7-9-15(17)6-3/h7-9H,4-6,10-13H2,1-3H3
47 atoms
Cl -2.903131 -3.186907 0.647964
O  2.104796 -0.199951 -1.599159
O  0.034573 -3.150618 1.025397
N  0.288036 -0.927516 0.699798
C  -0.276653 0.350001 0.412673
C  -0.835865 0.602851 -0.849105
C  -0.232605 1.3467 1.396466
C  1.739899 -1.048326 0.686985
C  -0.958094 -0.437144 -1.933685
C  0.334927 1.115874 2.774094
C  2.356093 -1.234562 -0.692252
C  -1.320316 1.880841 -1.107979
C  -0.733772 2.608131 1.092852
C  -0.452999 -2.048803 0.9413
C  -1.267128 2.880049 -0.153057
C  -2.405526 -0.73648 -2.320828
C  1.616297 1.908338 3.031173
C  2.67859 1.041749 -1.284878
C  -1.933682 -1.816126 1.212977
C  2.418022 2.007096 -2.423448
C  2.953841 3.397126 -2.114473
H  2.15845 -0.166865 1.174924
H  2.02034 -1.906846 1.297004
H  -0.467878 -1.36513 -1.647338
H  -0.415133 -0.082207 -2.811902
H  -0.414899 1.412757 3.512498
H  0.517643 0.05503 2.946013
H  3.438599 -1.383355 -0.551767
H  1.960614 -2.146924 -1.142194
H  -1.744176 2.09583 -2.081623
H  -0.712236 3.383519 1.849731
H  -1.649463 3.867101 -0.377786
H  -2.931199 0.155412 -2.661474
H  -2.972559 -1.158908 -1.492187
H  -2.434837 -1.463138 -3.132432
H  2.401297 1.647644 2.320476
H  1.998275 1.714474 4.033357
H  1.447034 2.981489 2.943828
H  2.253763 1.462788 -0.362036
H  3.762745 0.937002 -1.118515
H  -2.329102 -0.911046 0.763747
H  -2.06338 -1.732206 2.293413
H  2.871265 1.621143 -3.339526
H  1.34066 2.058564 -2.598296
H  2.770955 4.083001 -2.940836
H  4.030111 3.384166 -1.934206
H  2.47501 3.817695 -1.22872
totalener: -1328.96992626 hartree
nucrepener: 2010.45839593 hartree
electener: -3339.42832219 hartree
oneelecener: -5811.83441040 hartree
twoeener: 2472.40608821 hartree
kineticenergy: 1324.30835079 hartree
xcener: -107.430778400869 hartree
chargesum: -0.0000000
charge: -0.111461 -0.319079 -0.369314 0.014262 0.049919 -0.132383 -0.082380 -0.110401 -0.142258 -0.202512 -0.009557 -0.088114 -0.047134 0.248027 -0.158391 -0.233873 -0.236436 0.040471 -0.103302 -0.087442 -0.260353 0.105475 0.111155 0.077090 0.091222 0.093357 0.085673 0.078293 0.104253 0.118120 0.113179 0.126688 0.073694 0.075596 0.091490 0.074525 0.095699 0.080785 0.036996 0.084731 0.128558 0.129734 0.069958 0.056498 0.087757 0.075585 0.075599
qa: -0.1115 -0.3191 -0.3693 0.0143 0.0499 -0.1324 -0.0824 -0.1104 -0.1423 -0.2025 -0.0096 -0.0881 -0.0471 0.2480 -0.1584 -0.2339 -0.2364 0.0405 -0.1033 -0.0874 -0.2604 0.1055 0.1112 0.0771 0.0912 0.0934 0.0857 0.0783 0.1043 0.1181 0.1132 0.1267 0.0737 0.0756 0.0915 0.0745 0.0957 0.0808 0.0370 0.0847 0.1286 0.1297 0.0700 0.0565 0.0878 0.0756 0.0756
va: 1.1609 1.9745 2.1449 2.9184 3.6576 3.7796 3.7618 3.7908 3.8801 3.8869 3.9083 3.8357 3.8506 4.1447 4.0287 3.9180 3.9194 3.9347 4.0500 3.9005 3.9525 0.9916 1.0423 1.0199 1.0082 1.0002 1.0146 1.0068 1.0042 1.0042 1.0045 1.0013 1.0085 1.0245 1.0071 1.0059 1.0086 1.0065 0.9743 1.0003 0.9959 1.0040 1.0160 1.0148 1.0063 1.0045 1.0025
dispcorr: -0.029604880 hartree
energy: -1328.999531141996
dipole: 20.39346 -19.81110 0.58236 26.31957 -24.32659 1.99298 -6.86556 7.13239 0.26683
magnitude: 2.09340 au
magnitude: 5.32100 debye
