program: Gaussian 09
title: 000056167
version: EM64L-G09RevD.01
frameworkgroup: C1[X(C10H13BrN2O3)]
method: RPBEPBE
basis: SDD
operation: Freq
keyword: #p
keyword: freq=noraman
keyword: PBEPBE/SDD
title: #p freq=noraman PBEPBE/SDD
converged: YES YES NO NO
title: Mulliken charges:
elementType: Br O O O N N C C C C C C C C C C H H H H H H H H H H H H H
charge: 0.005082 -0.190925 -0.206995 -0.217469 -0.371266 -0.373329 0.100694 -0.400699 -0.545028 0.163345 0.150553 -0.371682 0.061931 -0.698432 0.156395 -0.566059 0.244688 0.209435 0.265278 0.274386 0.213441 0.220881 0.369551 0.368219 0.213282 0.215351 0.221498 0.251829 0.236046
chargesum: 0.00000
title: Mulliken charges with hydrogens summed into heavy atoms:
elementType: Br O O O N N C C C C C C C C C C
charge: 0.005082 -0.190925 -0.206995 -0.217469 -0.001715 -0.005110 0.100694 0.053424 -0.005364 0.163345 0.150553 0.062640 0.061931 -0.048301 0.156395 -0.078184
polarizability: 1.41150266e+02 -1.58321562e-01 1.75417856e+02 1.69336783e+01 -1.10069312e+01 1.14655085e+02
1716.lowfreq: -10.2416 -7.1473 -4.1812 -0.0008 -0.0004 -0.0003 25.4600 28.9714 58.5785
frequency: 25.4228 28.8365 58.5091 66.6926 92.1603 107.1497 118.8911 138.8911 153.9699 173.2044 200.3956 237.9884 282.9617 284.0724 335.2572 343.1470 359.1046 371.7247 393.9666 477.2003 481.3370 492.5169 555.5240 596.9765 627.7908 650.6688 659.3024 685.8262 720.0920 737.9757 749.9466 760.2632 784.6636 837.4362 878.2869 916.5461 919.9758 925.1007 968.0633 984.6761 990.7711 1050.7666 1083.4139 1114.6764 1144.8858 1154.1432 1193.4083 1239.2803 1268.0589 1287.9163 1302.7593 1313.6146 1325.9853 1356.1272 1361.2286 1376.3680 1376.6066 1392.6428 1405.2265 1448.7940 1456.8730 1471.8504 1480.1884 1484.5606 1618.6704 1639.9474 1656.4340 1677.6066 2977.2297 2980.4139 3001.3049 3008.7158 3029.9750 3066.7485 3070.8552 3079.0285 3082.2842 3103.6091 3221.7714 3518.3855 3520.3841
redmass: 9.5125 6.3434 4.7273 2.8163 2.6514 3.6460 6.2388 6.3622 11.5911 4.2956 5.1089 1.1494 3.2430 2.5603 3.6132 3.6399 11.2168 8.4836 3.2603 6.0231 6.2671 4.4252 4.4234 6.5169 3.8383 1.3491 2.3790 2.3953 3.2274 1.2451 2.6245 2.3960 1.7079 1.6109 1.6414 2.1680 1.7062 1.9140 2.1253 2.4221 3.2433 3.1766 2.0819 2.4384 2.5419 2.8498 3.2973 1.3446 1.4130 1.5604 1.2057 2.0767 1.4336 1.4884 8.3554 1.9347 1.5414 1.2067 1.1507 1.0836 1.0984 1.0659 1.0422 1.0680 7.1641 5.8231 8.6872 5.5579 1.0355 1.0592 1.0588 1.0598 1.1001 1.1031 1.1012 1.0992 1.1031 1.0639 1.1137 1.0759 1.0781
irintensity: 0.2654 1.3500 0.0295 0.0738 0.3436 0.0522 0.3807 0.6696 13.2067 2.0473 0.0979 0.0853 3.1373 2.5577 4.1747 1.9130 26.0050 5.0879 2.7708 20.1068 22.7869 7.8607 12.6067 0.7885 8.1778 6.6733 10.4228 26.2081 16.7836 5.3480 4.2741 8.6348 196.3432 1.1229 2.9372 5.7683 73.6524 11.6930 14.7250 2.1268 9.4809 1.6212 14.7061 9.9750 26.3435 45.3120 65.9123 21.5845 23.7627 68.7442 14.0983 166.0571 52.9376 17.4724 223.2043 5.1124 5.3830 7.9716 10.6835 14.9530 17.2074 1.7997 13.7601 12.7835 298.8647 57.2377 75.9968 609.4015 36.7968 16.7918 5.2300 19.4487 3.3605 5.6845 16.4436 41.7295 39.6052 1.2735 3.1524 86.7597 47.4534
temp: 298.150 k
press: 1.00000 atm
elementType: 35 8 8 8 7 7 6 6 6 6 6 6 6 6 6 6 1 1 1 1 1 1 1 1 1 1 1 1 1
symmnumber: 1
zpe: 583275.4 jmol-1
zpe.correction: 0.222158 hartree
zpe.thermalcorrener: 0.238895 hartree
zpe.thermalcorrenthalpy: 0.239839 hartree
zpe.thermalcorrgfe: 0.175608 hartree
zpe.sumelectzpe: -736.316323 hartree
zpe.sumelectthermal: -736.299586 hartree
zpe.sumelectthermalent: -736.298642 hartree
zpe.sumelectthermalfe: -736.362872 hartree
dipole: 0.4091 -1.6862 1.0595
dipole: 2.0330
quadrupole: -108.0612 -107.7339 -108.6227
quadrupole: 0.1537 -4.4399 -1.2827
quadrupole: 0.0781 0.4053 -0.4834 0.1537 -4.4399 -1.2827
hfenergy: -736.5384805 hartree
pointgroup: C01 [X(C10H13Br1N2O3)]
dipole: -0.5698965 0.3780014 -0.4148578 debye
polarizability: 171.6043242|-10.441583|145.8995624|5.5250441|-18.848723|113.7193211 unknown
InChI: InChI=1S/C10H13BrN2O3/c1-3-4-10(5-6(2)11)7(14)12-9(16)13-8(10)15/h12-13H,2-5H2,1H3
charge 0 multiplicity 1
29 atoms
Br -1.132995 -3.511479 0.045887
O  -0.556974 -0.681463 1.984723
O  0.728333 1.730078 -1.980786
O  3.83481 -0.705763 0.475887
N  1.591316 -0.791082 1.135053
N  2.235676 0.478112 -0.751795
C  -0.215129 0.221115 -0.280391
C  -1.363318 1.230608 -0.01158
C  -0.701096 -0.919453 -1.295595
C  0.229769 -0.43126 1.040075
C  0.929696 0.901577 -1.056496
C  -0.966322 2.428859 0.882385
C  -1.789304 -1.843446 -0.799708
C  -2.156932 3.386632 1.102832
C  2.637643 -0.375253 0.296438
C  -3.122101 -1.663135 -0.937229
H  -2.191134 0.677136 0.466121
H  -1.715408 1.609755 -0.989484
H  0.172446 -1.513544 -1.619787
H  -1.078275 -0.372714 -2.180434
H  -0.132131 2.986278 0.412761
H  -0.610377 2.060878 1.864089
H  1.868853 -1.343256 1.953414
H  2.994487 0.849968 -1.332886
H  -2.520205 3.797667 0.142362
H  -3.000807 2.86309 1.589866
H  -1.870978 4.237474 1.747117
H  -3.856739 -2.383607 -0.569599
H  -3.497902 -0.760672 -1.43474
