program: Orca
programVersion: 5.0.2
elementType: Cl O O N C C C C C C C C C C C C C C C C C H H H H H H H H H H H H H H H H H H H H H H H H H H
charge: 0
multiplicity: 1
keywords: wb97x-d3
keywords: def2-TZVPP
keywords: def2/J RIJCOSX
keywords: DEFGRID2
keywords: scfconv7
keywords: smallprint printgap noloewdin
keywords: NOSOSCF
formula: C17H26ClNO2
InChI: InChI=1/C17H26ClNO2/c1-4-11-21-12-10-19(16(20)13-18)17-14(5-2)8-7-9-15(17)6-3/h7-9H,4-6,10-13H2,1-3H3
47 atoms
Cl -2.740201 -2.17606 1.492157
O  2.403074 0.653411 -0.819645
O  0.639106 -2.749339 1.270779
N  0.018696 -0.907246 0.118102
C  -0.761618 0.281487 0.017742
C  -1.852472 0.30162 -0.860166
C  -0.417901 1.411178 0.773304
C  0.957803 -1.225828 -0.948702
C  -2.25397 -0.882233 -1.701002
C  0.742452 1.445743 1.736864
C  2.375249 -0.74349 -0.71797
C  -2.595275 1.471549 -0.970225
C  -1.189038 2.559417 0.628806
C  -0.087646 -1.786483 1.151589
C  -2.268393 2.59529 -0.234938
C  -2.02191 -0.653638 -3.193412
C  0.341186 1.788368 3.170403
C  3.634717 1.242121 -0.490518
C  -1.205024 -1.546314 2.154108
C  4.744977 0.979262 -1.500651
C  4.365551 1.36635 -2.922084
H  0.977131 -2.307277 -1.084779
H  0.582915 -0.785404 -1.87294
H  -3.314443 -1.082064 -1.530478
H  -1.734098 -1.783426 -1.379647
H  1.282524 0.500908 1.732211
H  1.457295 2.192496 1.383468
H  2.736724 -1.085757 0.261858
H  3.015144 -1.218577 -1.475817
H  -3.449939 1.494734 -1.636102
H  -0.93279 3.44504 1.197581
H  -2.855717 3.49892 -0.332096
H  -2.324879 -1.52831 -3.769268
H  -0.972027 -0.458123 -3.413114
H  -2.591604 0.19894 -3.563416
H  -0.354859 1.058645 3.585357
H  -0.137535 2.764774 3.239846
H  1.217884 1.807947 3.817975
H  3.44399 2.317326 -0.436811
H  3.963102 0.921987 0.509995
H  -1.365958 -0.500377 2.398059
H  -0.979824 -2.105418 3.058281
H  5.619846 1.550966 -1.178353
H  5.053217 -0.069572 -1.468127
H  4.079985 2.417763 -2.983067
H  3.522294 0.780667 -3.286795
H  5.197882 1.209972 -3.60796
totalener: -1328.97149122 hartree
nucrepener: 1987.68563291 hartree
electener: -3316.65712413 hartree
oneelecener: -5766.62496384 hartree
twoeener: 2449.96783971 hartree
kineticenergy: 1324.30513924 hartree
xcener: -107.426527668727 hartree
chargesum: 0.0000000
charge: -0.129855 -0.313980 -0.384884 -0.004907 0.141512 -0.119307 -0.132603 -0.031916 -0.217008 -0.231294 -0.040786 -0.041400 -0.039089 0.253446 -0.178852 -0.230549 -0.222102 0.001625 -0.081797 -0.128866 -0.233019 0.106562 0.100900 0.094665 0.081317 0.082805 0.093018 0.098715 0.082440 0.111483 0.113588 0.122887 0.089342 0.077503 0.076216 0.070254 0.078129 0.090482 0.083209 0.078609 0.118114 0.146093 0.068592 0.062727 0.071931 0.079972 0.086079
qa: -0.1299 -0.3140 -0.3849 -0.0049 0.1415 -0.1193 -0.1326 -0.0319 -0.2170 -0.2313 -0.0408 -0.0414 -0.0391 0.2534 -0.1789 -0.2305 -0.2221 0.0016 -0.0818 -0.1289 -0.2330 0.1066 0.1009 0.0947 0.0813 0.0828 0.0930 0.0987 0.0824 0.1115 0.1136 0.1229 0.0893 0.0775 0.0762 0.0703 0.0781 0.0905 0.0832 0.0786 0.1181 0.1461 0.0686 0.0627 0.0719 0.0800 0.0861
va: 1.1476 1.9487 2.1219 2.9570 3.7467 3.7824 3.7593 3.8814 3.9189 3.9448 3.9506 3.8627 3.8486 4.1425 4.0686 3.9283 3.9163 3.9155 3.9800 3.9194 3.9336 1.0218 1.0127 1.0012 1.0192 1.0057 1.0001 1.0037 0.9944 1.0052 1.0032 1.0030 1.0068 1.0060 1.0074 1.0112 1.0078 1.0076 0.9911 0.9994 1.0219 1.0055 1.0147 1.0038 1.0052 1.0089 1.0064
dispcorr: -0.027633976 hartree
energy: -1328.999125194403
dipole: 23.31400 -22.83052 0.48348 15.79902 -14.56237 1.23664 -13.31409 12.98112 -0.33297
magnitude: 1.36891 au
magnitude: 3.47949 debye
