program: Orca
programVersion: 5.0.2
elementType: Cl O O N C C C C C C C C C C C C C C C C C H H H H H H H H H H H H H H H H H H H H H H H H H H
charge: 0
multiplicity: 1
keywords: wb97x-d3
keywords: def2-TZVPP
keywords: def2/J RIJCOSX
keywords: DEFGRID2
keywords: scfconv7
keywords: smallprint printgap noloewdin
keywords: NOSOSCF
formula: C17H26ClNO2
InChI: InChI=1/C17H26ClNO2/c1-4-11-21-12-10-19(16(20)13-18)17-14(5-2)8-7-9-15(17)6-3/h7-9H,4-6,10-13H2,1-3H3
47 atoms
Cl -2.046793 -1.144816 2.844376
O  2.496428 0.51672 -0.699153
O  -0.057645 -3.394074 1.154226
N  0.175065 -1.306482 0.312233
C  -0.391864 -0.019628 0.075314
C  -1.214175 0.173315 -1.03928
C  -0.128322 1.018669 0.980438
C  1.578017 -1.584807 0.009706
C  -1.482606 -0.909974 -2.054104
C  0.795916 0.804178 2.150127
C  2.1639 -0.7737 -1.126528
C  -1.822464 1.41481 -1.206772
C  -0.735722 2.247191 0.760254
C  -0.533142 -2.306169 0.912026
C  -1.586542 2.442683 -0.315849
C  -1.101075 -0.505814 -3.476583
C  0.567698 1.725085 3.340135
C  3.337706 1.223982 -1.575438
C  -1.979709 -2.015134 1.284713
C  2.67773 1.661007 -2.875997
C  1.459644 2.544507 -2.66048
H  2.198578 -1.453365 0.901192
H  1.646855 -2.638235 -0.26035
H  -2.545993 -1.169242 -2.034039
H  -0.947179 -1.821576 -1.790662
H  0.707687 -0.227023 2.493266
H  1.82389 0.914004 1.793997
H  3.066461 -1.304638 -1.46592
H  1.471172 -0.763453 -1.978359
H  -2.484338 1.576331 -2.048961
H  -0.559784 3.06475 1.445865
H  -2.064093 3.403289 -0.458869
H  -0.045395 -0.239866 -3.543311
H  -1.672373 0.353805 -3.825506
H  -1.284488 -1.325168 -4.171578
H  0.805451 2.765477 3.117498
H  1.205868 1.424007 4.170202
H  -0.466433 1.679547 3.682093
H  3.666857 2.107132 -1.0225
H  4.236752 0.630151 -1.800868
H  -2.485655 -2.967147 1.421216
H  -2.517456 -1.415224 0.555729
H  3.432965 2.195921 -3.459098
H  2.408847 0.788112 -3.479151
H  1.011993 2.839068 -3.609776
H  1.726179 3.457143 -2.124484
H  0.694391 2.038175 -2.074945
totalener: -1328.96815043 hartree
nucrepener: 2039.10681590 hartree
electener: -3368.07496633 hartree
oneelecener: -5869.47539100 hartree
twoeener: 2501.40042467 hartree
kineticenergy: 1324.30565826 hartree
xcener: -107.432024456430 hartree
chargesum: 0.0000000
charge: -0.127967 -0.303141 -0.381025 -0.011593 0.126648 -0.155640 -0.104629 -0.059997 -0.232973 -0.190968 -0.011663 -0.032418 -0.038181 0.232760 -0.173164 -0.230577 -0.262927 0.008475 -0.065907 -0.127253 -0.199383 0.099354 0.112685 0.094256 0.093222 0.093035 0.089094 0.091131 0.075098 0.104273 0.114855 0.121612 0.065250 0.084603 0.095900 0.074453 0.089048 0.092825 0.080724 0.070179 0.143725 0.120996 0.071043 0.061269 0.088588 0.079571 0.034733
qa: -0.1280 -0.3031 -0.3810 -0.0116 0.1266 -0.1556 -0.1046 -0.0600 -0.2330 -0.1910 -0.0117 -0.0324 -0.0382 0.2328 -0.1732 -0.2306 -0.2629 0.0085 -0.0659 -0.1273 -0.1994 0.0994 0.1127 0.0943 0.0932 0.0930 0.0891 0.0911 0.0751 0.1043 0.1149 0.1216 0.0653 0.0846 0.0959 0.0745 0.0890 0.0928 0.0807 0.0702 0.1437 0.1210 0.0710 0.0613 0.0886 0.0796 0.0347
va: 1.1484 1.9722 2.1276 2.9246 3.6517 3.6832 3.7725 3.8588 3.8809 3.8537 3.9585 3.7989 3.8089 4.1682 4.0492 3.9373 3.9470 3.9303 3.9693 3.8726 3.9161 1.0116 1.0238 0.9963 1.0107 1.0057 1.0169 1.0017 0.9760 1.0092 1.0038 1.0042 1.0076 1.0061 1.0098 0.9993 1.0073 1.0073 0.9969 1.0042 1.0093 1.0104 1.0186 1.0020 1.0087 1.0121 1.0123
dispcorr: -0.030556827 hartree
energy: -1328.998707253631
dipole: 14.91185 -14.67983 0.23202 14.91904 -13.91503 1.00402 -22.97209 21.56654 -1.40555
magnitude: 1.74283 au
magnitude: 4.42992 debye
