program: Orca
programVersion: 5.0.2
elementType: Cl O O N C C C C C C C C C C C C C C C C C H H H H H H H H H H H H H H H H H H H H H H H H H H
charge: 0
multiplicity: 1
keywords: wb97x-d3
keywords: def2-TZVPP
keywords: def2/J RIJCOSX
keywords: DEFGRID2
keywords: scfconv7
keywords: smallprint printgap noloewdin
keywords: NOSOSCF
formula: C17H26ClNO2
InChI: InChI=1/C17H26ClNO2/c1-4-11-21-12-10-19(16(20)13-18)17-14(5-2)8-7-9-15(17)6-3/h7-9H,4-6,10-13H2,1-3H3
47 atoms
Cl -3.106601 -1.859586 0.568922
O  2.207973 0.007771 -1.284384
O  -0.161646 -3.326255 1.605814
N  0.222519 -1.317719 0.639507
C  -0.233144 -0.002203 0.333678
C  -0.817567 0.243531 -0.916914
C  -0.077606 1.013259 1.283363
C  1.509848 -1.792438 0.130989
C  -0.918939 -0.845115 -1.952425
C  0.546175 0.767146 2.636266
C  2.516525 -0.688397 -0.111204
C  -1.265172 1.529593 -1.186492
C  -0.547132 2.28725 0.972095
C  -0.52826 -2.198183 1.359279
C  -1.13517 2.543372 -0.250786
C  -2.062491 -0.692819 -2.94548
C  1.641811 1.763992 3.004614
C  2.674665 1.330484 -1.315036
C  -1.881324 -1.714181 1.861404
C  2.26983 1.977998 -2.623003
C  2.699352 3.436814 -2.677633
H  1.923497 -2.481338 0.867536
H  1.371327 -2.369084 -0.78894
H  -1.020392 -1.810202 -1.456255
H  0.032236 -0.885112 -2.491116
H  -0.235358 0.802902 3.402845
H  0.958629 -0.240378 2.684479
H  2.549614 -0.018032 0.758471
H  3.512038 -1.149109 -0.18495
H  -1.730671 1.748924 -2.137988
H  -0.456211 3.085517 1.698081
H  -1.499102 3.536882 -0.478542
H  -2.12006 -1.573715 -3.584236
H  -1.937052 0.167286 -3.603519
H  -3.019407 -0.590534 -2.433611
H  1.267866 2.784531 3.075403
H  2.443365 1.760438 2.265259
H  2.078007 1.51113 3.97071
H  2.251572 1.901584 -0.47459
H  3.770177 1.365113 -1.207234
H  -1.887892 -0.680899 2.197595
H  -2.187491 -2.366387 2.674941
H  2.710823 1.424142 -3.455385
H  1.1853 1.90559 -2.7309
H  2.233189 4.016358 -1.879314
H  2.416534 3.89667 -3.623806
H  3.780531 3.542709 -2.574434
totalener: -1328.96960095 hartree
nucrepener: 2033.05960546 hartree
electener: -3362.02920641 hartree
oneelecener: -5857.21147746 hartree
twoeener: 2495.18227105 hartree
kineticenergy: 1324.30904711 hartree
xcener: -107.431807046279 hartree
chargesum: -0.0000000
charge: -0.127664 -0.313152 -0.379760 -0.017650 0.171533 -0.087376 -0.199376 -0.046679 -0.195552 -0.213295 -0.029338 -0.118609 -0.037519 0.234052 -0.146677 -0.252724 -0.240178 0.026530 -0.065013 -0.088410 -0.259625 0.112895 0.100631 0.097146 0.089257 0.091273 0.094661 0.074153 0.095761 0.120283 0.110272 0.124791 0.090039 0.072374 0.091910 0.081824 0.075724 0.094708 0.048311 0.087064 0.117920 0.144581 0.069780 0.061585 0.076333 0.088152 0.075052
qa: -0.1277 -0.3132 -0.3798 -0.0176 0.1715 -0.0874 -0.1994 -0.0467 -0.1956 -0.2133 -0.0293 -0.1186 -0.0375 0.2341 -0.1467 -0.2527 -0.2402 0.0265 -0.0650 -0.0884 -0.2596 0.1129 0.1006 0.0971 0.0893 0.0913 0.0947 0.0742 0.0958 0.1203 0.1103 0.1248 0.0900 0.0724 0.0919 0.0818 0.0757 0.0947 0.0483 0.0871 0.1179 0.1446 0.0698 0.0616 0.0763 0.0882 0.0751
va: 1.1496 1.9772 2.1301 2.9157 3.5424 3.6992 3.7294 3.8280 3.8564 3.8812 3.9964 3.8083 3.8326 4.1701 4.0334 3.9378 3.9388 3.9297 3.9665 3.8979 3.9538 1.0252 1.0082 1.0072 1.0146 0.9960 1.0092 0.9851 1.0045 1.0046 1.0066 1.0012 1.0074 1.0012 1.0088 1.0057 1.0061 1.0078 0.9826 0.9965 1.0118 1.0084 1.0142 1.0153 1.0026 1.0059 1.0048
dispcorr: -0.030023589 hartree
energy: -1328.999624539490
dipole: 21.67727 -20.95772 0.71954 21.30359 -19.69948 1.60411 -9.37273 9.45661 0.08388
magnitude: 1.76010 au
magnitude: 4.47381 debye
