program: Orca
programVersion: 5.0.2
elementType: Cl O O N C C C C C C C C C C C C C C C C C H H H H H H H H H H H H H H H H H H H H H H H H H H
charge: 0
multiplicity: 1
keywords: wb97x-d3
keywords: def2-TZVPP
keywords: def2/J RIJCOSX
keywords: DEFGRID2
keywords: scfconv7
keywords: smallprint printgap noloewdin
keywords: NOSOSCF
formula: C17H26ClNO2
InChI: InChI=1/C17H26ClNO2/c1-4-11-21-12-10-19(16(20)13-18)17-14(5-2)8-7-9-15(17)6-3/h7-9H,4-6,10-13H2,1-3H3
47 atoms
Cl -2.392354 -1.539726 2.433545
O  2.542552 0.122157 -1.191708
O  0.304203 -3.097414 1.022162
N  0.344263 -0.866628 0.657455
C  -0.324506 0.326263 0.258229
C  -0.710435 0.492088 -1.077759
C  -0.545166 1.328053 1.213897
C  1.786041 -0.822933 0.856253
C  -0.48365 -0.550155 -2.144523
C  -0.107671 1.159737 2.648009
C  2.608243 -1.029535 -0.399435
C  -1.325093 1.685935 -1.44128
C  -1.157397 2.506128 0.802155
C  -0.289637 -2.059693 0.825967
C  -1.544439 2.686754 -0.513919
C  -1.766725 -1.033748 -2.81822
C  -1.052847 1.76539 3.678301
C  3.276819 0.030877 -2.383968
C  -1.80993 -2.039286 0.818609
C  3.38456 1.402788 -3.021174
C  2.045442 2.024336 -3.392308
H  2.045676 0.143072 1.292208
H  2.053999 -1.591773 1.579702
H  0.05728 -1.408096 -1.74914
H  0.170809 -0.119325 -2.905522
H  0.0103 0.100313 2.872329
H  0.88636 1.604252 2.769166
H  3.647961 -1.234237 -0.099985
H  2.255283 -1.92082 -0.936993
H  -1.620075 1.838833 -2.47249
H  -1.337938 3.296355 1.518527
H  -2.016413 3.612328 -0.816593
H  -1.53746 -1.764686 -3.593751
H  -2.312667 -0.217366 -3.290474
H  -2.446998 -1.510263 -2.111859
H  -2.06411 1.380078 3.552586
H  -1.096013 2.852883 3.622134
H  -0.720478 1.511845 4.684583
H  4.286892 -0.358444 -2.185978
H  2.799022 -0.676324 -3.080186
H  -2.168228 -3.04872 0.635997
H  -2.245775 -1.356128 0.095689
H  3.92629 2.066149 -2.341976
H  4.007663 1.303077 -3.914092
H  2.184963 2.998112 -3.861706
H  1.412892 2.165205 -2.516716
H  1.502596 1.396783 -4.102358
totalener: -1328.97252284 hartree
nucrepener: 2010.87674953 hartree
electener: -3339.84927237 hartree
oneelecener: -5812.95919790 hartree
twoeener: 2473.10992553 hartree
kineticenergy: 1324.30418726 hartree
xcener: -107.427668157337 hartree
chargesum: -0.0000000
charge: -0.130277 -0.303821 -0.380642 -0.004114 0.149048 -0.181247 -0.068835 -0.041224 -0.209245 -0.229740 -0.021178 -0.073470 -0.050800 0.251925 -0.153065 -0.225800 -0.249912 -0.017053 -0.092924 -0.079192 -0.267877 0.100776 0.105008 0.086462 0.077991 0.098291 0.087066 0.083713 0.090023 0.113723 0.114188 0.124179 0.091491 0.079240 0.072504 0.088603 0.077037 0.088175 0.078628 0.077284 0.147518 0.122831 0.059006 0.055443 0.093979 0.099632 0.066655
qa: -0.1303 -0.3038 -0.3806 -0.0041 0.1490 -0.1812 -0.0688 -0.0412 -0.2092 -0.2297 -0.0212 -0.0735 -0.0508 0.2519 -0.1531 -0.2258 -0.2499 -0.0171 -0.0929 -0.0792 -0.2679 0.1008 0.1050 0.0865 0.0780 0.0983 0.0871 0.0837 0.0900 0.1137 0.1142 0.1242 0.0915 0.0792 0.0725 0.0886 0.0770 0.0882 0.0786 0.0773 0.1475 0.1228 0.0590 0.0554 0.0940 0.0996 0.0667
va: 1.1507 1.9677 2.1269 2.9352 3.7525 3.6974 3.7852 3.8664 3.9148 3.8897 3.9355 3.8226 3.8602 4.1390 4.0549 3.9260 3.9357 3.9201 3.9766 3.9271 3.9220 1.0120 1.0266 1.0095 1.0123 1.0110 0.9964 1.0038 0.9965 1.0049 1.0054 1.0017 1.0068 1.0074 1.0122 1.0151 1.0024 1.0069 1.0001 0.9888 1.0051 1.0187 1.0149 1.0128 1.0098 1.0058 1.0016
dispcorr: -0.028927354 hartree
energy: -1329.001450195980
dipole: 14.12940 -13.75757 0.37183 13.03465 -12.07552 0.95912 -19.70569 18.74533 -0.96036
magnitude: 1.40729 au
magnitude: 3.57705 debye
