program: Gaussian 09
title: 000056184
version: EM64L-G09RevD.01
frameworkgroup: C1[X(C13H13NO5)]
method: RPBEPBE
basis: SDD
operation: Freq
keyword: #p
keyword: freq=noraman
keyword: PBEPBE/SDD
title: #p freq=noraman PBEPBE/SDD
converged: NO YES NO NO
title: Mulliken charges:
elementType: O O O O O N C C C C C C C C C C C C C H H H H H H H H H H H H H
charge: -0.239020 -0.246618 -0.408380 -0.211153 -0.232986 -0.241556 -0.165947 0.372532 0.153163 0.201145 -0.422658 -0.452667 -0.687322 0.299081 -0.351370 0.169203 -0.349484 0.112861 -0.788995 0.302817 0.267530 0.249639 0.295151 0.230568 0.256769 0.251346 0.259025 0.249800 0.239057 0.237066 0.261873 0.389528
chargesum: 0.00000
title: Mulliken charges with hydrogens summed into heavy atoms:
elementType: O O O O O N C C C C C C C C C C C C C
charge: -0.239020 -0.246618 -0.018851 -0.211153 -0.232986 -0.241556 0.136871 0.372532 0.153163 0.201145 0.094511 -0.157516 0.051361 0.299081 -0.092345 0.169203 -0.099684 0.112861 -0.050999
polarizability: 2.22513090e+02 1.46964296e+01 1.81373298e+02 -1.36402387e+00 5.60086522e+00 9.93711391e+01
1716.lowfreq: -6.4652 -3.1307 -0.0006 -0.0005 0.0006 6.9987 30.4541 45.9629 55.3648
frequency: 30.4188 45.9473 55.3570 68.6161 87.2154 102.0487 111.5325 148.8557 156.3428 169.5999 181.9829 218.4604 242.1423 289.9397 297.4649 313.0612 350.3097 380.8900 416.4494 441.0726 471.3409 477.0702 497.0713 524.2283 539.6675 549.5785 556.7924 586.4181 620.2731 648.2487 657.4322 664.7858 708.0504 725.2608 743.8285 804.2841 824.7145 832.7506 925.9238 937.7438 954.5465 962.3688 976.5170 999.7667 1011.5382 1026.4251 1034.3568 1061.4942 1082.5393 1119.5142 1125.2381 1151.0695 1207.3135 1208.9217 1240.2029 1271.1558 1285.2333 1297.6478 1315.5065 1322.8341 1342.0960 1360.3640 1370.8646 1392.7810 1400.0746 1440.7515 1448.0826 1451.2219 1463.8467 1472.4631 1483.1005 1494.3165 1574.2492 1587.2706 1605.2607 1626.1282 1660.3917 2967.2221 2983.5250 2986.5415 3012.8295 3071.3399 3110.7086 3123.5508 3125.3052 3133.1367 3155.2931 3166.8617 3176.8611 3517.0107
redmass: 7.0066 6.9790 4.1758 6.8834 7.2428 5.0658 4.3969 1.0444 3.7586 1.9227 1.7019 3.8986 3.7211 3.8116 7.0469 5.1420 6.4188 5.2781 3.6754 6.1992 4.1503 4.3642 4.4653 3.7442 3.8215 5.1622 4.6140 3.7002 1.6167 3.2290 5.4648 3.1495 6.0487 4.5243 4.1264 3.2926 1.7893 2.7096 1.4515 2.8163 1.3581 3.3496 2.1992 3.3515 2.0968 1.8324 2.9322 2.1502 2.1560 1.8639 2.7410 1.6086 1.7306 1.4506 2.3473 2.0594 1.7387 2.2316 2.4115 2.1938 1.3837 1.6906 1.3066 7.3429 1.1987 3.0580 1.1129 1.2222 1.0498 1.0552 1.0587 3.1591 7.3987 7.4259 9.5302 8.0090 9.5696 1.0800 1.0683 1.0374 1.0360 1.0970 1.1005 1.1001 1.0992 1.0958 1.0880 1.0911 1.0969 1.0642
irintensity: 0.7342 5.0739 1.0843 1.0692 1.0066 3.2035 2.8205 0.3717 9.5608 5.3753 3.0533 0.3943 2.3059 4.3471 1.7677 0.4800 0.5517 0.8731 6.4982 2.4606 0.8133 24.8714 26.6210 9.3648 13.8456 45.0225 12.2313 21.4505 55.6823 17.7870 8.8914 56.9074 14.2044 7.5604 0.2550 14.6819 29.8636 19.7369 18.1490 41.3146 1.0447 9.2640 0.5485 20.2889 50.9307 1.4466 210.5974 50.8408 9.6644 60.8188 2.3677 16.2990 11.0159 17.4539 165.7584 131.4998 79.7151 132.8598 43.6980 107.3246 11.9981 39.3266 19.8841 46.4020 14.5868 161.4491 31.5997 40.1337 20.7343 7.3478 8.4396 65.1203 117.0684 68.0631 274.2632 137.8688 196.0680 35.0519 35.7464 3.1011 14.1015 11.6758 10.8149 14.0968 16.3796 3.3964 4.3056 11.3262 4.2677 38.6083
temp: 298.150 k
press: 1.00000 atm
elementType: 8 8 8 8 8 7 6 6 6 6 6 6 6 6 6 6 6 6 6 1 1 1 1 1 1 1 1 1 1 1 1 1
symmnumber: 1
zpe: 632590.1 jmol-1
zpe.correction: 0.240941 hartree
zpe.thermalcorrener: 0.258751 hartree
zpe.thermalcorrenthalpy: 0.259695 hartree
zpe.thermalcorrgfe: 0.194366 hartree
zpe.sumelectzpe: -932.681757 hartree
zpe.sumelectthermal: -932.663947 hartree
zpe.sumelectthermalent: -932.663003 hartree
zpe.sumelectthermalfe: -932.728332 hartree
dipole: 1.8957 -1.5550 0.6505
dipole: 2.5367
quadrupole: -111.9066 -103.2263 -112.3189
quadrupole: -11.9319 -0.8435 2.0134
quadrupole: -2.7560 5.9243 -3.1683 -11.9319 -0.8435 2.0134
hfenergy: -932.9226982 hartree
pointgroup: C01 [X(C13H13N1O5)]
dipole: -0.6702234 0.6958644 0.250245 debye
polarizability: 225.3133333|9.6308581|178.4315869|0.1483822|-6.6769506|99.5126078 unknown
InChI: InChI=1S/C13H13NO5/c1-7(13(17)18)14-10-5-9(8(2)15)3-4-11(10)19-6-12(14)16/h3-5,7,17H,6H2,1-2H3
charge 0 multiplicity 1
32 atoms
O  1.27101 2.773974 0.059464
O  3.823313 0.190316 0.023506
O  1.058893 -3.696824 -0.15465
O  1.077045 -2.03746 -1.780231
O  -3.376174 -1.671761 0.038099
N  1.497175 -0.047356 0.193101
C  1.673105 -1.47263 0.567308
C  0.202895 0.555435 0.070449
C  0.114795 1.980603 0.030044
C  2.662405 0.682242 -0.072621
C  2.453736 2.120368 -0.540407
C  -0.992928 -0.184728 0.042879
C  1.108436 -1.828296 1.95847
C  -2.257354 0.45968 0.01097
C  -1.131976 2.633783 0.007932
C  1.221341 -2.378572 -0.589322
C  -2.319238 1.878092 0.00357
C  -3.480945 -0.408746 -0.006245
C  -4.853453 0.252746 -0.076675
H  2.776086 -1.600536 0.605872
H  3.321877 2.721755 -0.23791
H  2.359523 2.134507 -1.645562
H  -1.00591 -1.277982 0.044488
H  1.585875 -1.185876 2.717987
H  1.340205 -2.880322 2.187982
H  0.017177 -1.69774 2.024539
H  -1.143565 3.727279 -0.009757
H  -3.282885 2.395526 -0.01611
H  -4.948979 0.876707 -0.984578
H  -5.025394 0.908132 0.797484
H  -5.626561 -0.530126 -0.094704
H  0.816069 -4.271792 -0.930371
