program: Orca
programVersion: 5.0.2
elementType: Cl O O N C C C C C C C C C C C C C C C C C H H H H H H H H H H H H H H H H H H H H H H H H H H
charge: 0
multiplicity: 1
keywords: wb97x-d3
keywords: def2-TZVPP
keywords: def2/J RIJCOSX
keywords: DEFGRID2
keywords: scfconv7
keywords: smallprint printgap noloewdin
keywords: NOSOSCF
formula: C17H26ClNO2
InChI: InChI=1/C17H26ClNO2/c1-4-11-21-12-10-19(16(20)13-18)17-14(5-2)8-7-9-15(17)6-3/h7-9H,4-6,10-13H2,1-3H3
47 atoms
Cl -2.931127 -2.16041 1.375042
O  2.50647 0.2520 -0.971522
O  0.381218 -3.006138 0.909395
N  -0.146933 -1.024617 -0.036352
C  -0.865699 0.205429 0.000484
C  -1.982795 0.366946 -0.827261
C  -0.447871 1.227207 0.86491
C  0.716966 -1.320966 -1.172424
C  -2.466178 -0.696537 -1.777904
C  0.738151 1.070031 1.783193
C  2.199674 -1.11532 -0.929854
C  -2.681399 1.567933 -0.772091
C  -1.18547 2.405797 0.89614
C  -0.272555 -1.985099 0.920152
C  -2.292675 2.57936 0.085173
C  -2.245172 -0.323239 -3.242686
C  1.643634 2.294672 1.84119
C  3.862704 0.516721 -0.724665
C  -1.310025 -1.755898 2.007786
C  4.201893 1.932433 -1.14639
C  5.6640 2.259774 -0.878512
H  0.558856 -2.35906 -1.46839
H  0.40608 -0.692407 -2.006614
H  -3.533966 -0.85108 -1.605702
H  -1.99598 -1.655468 -1.564284
H  0.382435 0.84433 2.795242
H  1.335306 0.212948 1.47995
H  2.493389 -1.572715 0.023733
H  2.7488 -1.654259 -1.717567
H  -3.55548 1.699035 -1.399111
H  -0.891229 3.202791 1.566626
H  -2.855188 3.502878 0.127383
H  -2.613473 -1.109343 -3.902126
H  -1.188983 -0.17021 -3.465442
H  -2.765496 0.5983 -3.504657
H  1.953602 2.587455 0.839866
H  2.539005 2.077117 2.423555
H  1.159567 3.153139 2.306188
H  4.099527 0.372356 0.341402
H  4.501781 -0.186561 -1.281641
H  -1.351571 -0.735142 2.37748
H  -1.097338 -2.435207 2.82871
H  3.978397 2.051904 -2.209062
H  3.560962 2.638412 -0.613726
H  5.906087 2.173997 0.182068
H  5.903004 3.276958 -1.186023
H  6.331144 1.58907 -1.422675
totalener: -1328.97283893 hartree
nucrepener: 1975.05364647 hartree
electener: -3304.02648540 hartree
oneelecener: -5741.30304732 hartree
twoeener: 2437.27656192 hartree
kineticenergy: 1324.30050749 hartree
xcener: -107.424249765199 hartree
chargesum: 0.0000000
charge: -0.128663 -0.315302 -0.384999 -0.011500 0.124808 -0.127638 -0.144409 -0.024235 -0.204239 -0.174639 -0.042112 -0.044493 -0.046625 0.253504 -0.169110 -0.229457 -0.302156 0.006107 -0.074152 -0.088375 -0.255861 0.107254 0.096213 0.094500 0.082458 0.085389 0.090870 0.098972 0.078401 0.111913 0.113910 0.123742 0.089457 0.077165 0.076504 0.106219 0.091242 0.089763 0.069707 0.072875 0.117781 0.142652 0.063352 0.064583 0.074318 0.088527 0.075785
qa: -0.1287 -0.3153 -0.3850 -0.0115 0.1248 -0.1276 -0.1444 -0.0242 -0.2042 -0.1746 -0.0421 -0.0445 -0.0466 0.2535 -0.1691 -0.2295 -0.3022 0.0061 -0.0742 -0.0884 -0.2559 0.1073 0.0962 0.0945 0.0825 0.0854 0.0909 0.0990 0.0784 0.1119 0.1139 0.1237 0.0895 0.0772 0.0765 0.1062 0.0912 0.0898 0.0697 0.0729 0.1178 0.1427 0.0634 0.0646 0.0743 0.0885 0.0758
va: 1.1467 1.9677 2.1203 2.9747 3.7390 3.7972 3.8018 3.8486 3.9182 3.8848 3.9709 3.8736 3.8544 4.1542 4.0629 3.9279 3.9548 3.9126 3.9734 3.9050 3.9474 1.0168 1.0212 1.0012 1.0175 0.9941 1.0036 0.9985 1.0045 1.0051 1.0055 1.0028 1.0067 1.0059 1.0074 1.0028 1.0055 1.0064 0.9896 0.9982 1.0146 1.0084 1.0152 1.0139 1.0038 1.0059 1.0042
dispcorr: -0.027184115 hartree
energy: -1329.000023047335
dipole: 27.94766 -27.49105 0.45661 18.94138 -17.76875 1.17262 -11.29501 11.05287 -0.24214
magnitude: 1.28147 au
magnitude: 3.25724 debye
