program: Orca
programVersion: 5.0.2
elementType: Cl O O N C C C C C C C C C C C C C C C C C H H H H H H H H H H H H H H H H H H H H H H H H H H
charge: 0
multiplicity: 1
keywords: wb97x-d3
keywords: def2-TZVPP
keywords: def2/J RIJCOSX
keywords: DEFGRID2
keywords: scfconv7
keywords: smallprint printgap noloewdin
keywords: NOSOSCF
formula: C17H26ClNO2
InChI: InChI=1/C17H26ClNO2/c1-4-11-21-12-10-19(16(20)13-18)17-14(5-2)8-7-9-15(17)6-3/h7-9H,4-6,10-13H2,1-3H3
47 atoms
Cl -2.817758 -2.157774 1.202158
O  2.470536 0.488489 -0.664884
O  0.517217 -3.174457 1.45752
N  0.202036 -1.273942 0.264162
C  -0.424824 0.001433 0.145913
C  -1.3556 0.21167 -0.876396
C  -0.091198 1.02314 1.049448
C  1.242379 -1.631276 -0.689946
C  -1.76884 -0.861104 -1.850055
C  0.875351 0.808798 2.189325
C  2.562948 -0.898777 -0.491476
C  -1.943051 1.467976 -0.990485
C  -0.717996 2.254872 0.908932
C  -0.104815 -2.154288 1.259453
C  -1.632836 2.482028 -0.105233
C  -1.323529 -0.574128 -3.282346
C  1.874663 1.938241 2.409319
C  2.402547 0.915921 -2.003602
C  -1.319348 -1.829672 2.117646
C  1.851462 2.326493 -2.071744
C  2.720183 3.371696 -1.38769
H  1.425475 -2.701435 -0.604667
H  0.863831 -1.457744 -1.699114
H  -2.858325 -0.941092 -1.826081
H  -1.401991 -1.836125 -1.532822
H  0.302929 0.662937 3.112854
H  1.432799 -0.11458 2.043443
H  2.9265 -1.071904 0.523805
H  3.304062 -1.341049 -1.174486
H  -2.674186 1.641232 -1.771471
H  -0.489311 3.053665 1.602393
H  -2.109257 3.449274 -0.197535
H  -1.644835 -1.370231 -3.954106
H  -0.238527 -0.493171 -3.360771
H  -1.741777 0.361065 -3.6550
H  2.475095 2.094858 1.515704
H  2.548579 1.685967 3.228323
H  1.394876 2.881592 2.669311
H  3.401405 0.872191 -2.464621
H  1.754124 0.262131 -2.601974
H  -1.364764 -0.796367 2.449793
H  -1.307316 -2.489537 2.980706
H  1.73978 2.580276 -3.129811
H  0.84502 2.333902 -1.645722
H  2.298277 4.368947 -1.51467
H  3.729719 3.385305 -1.802761
H  2.804139 3.186915 -0.318232
totalener: -1328.96935095 hartree
nucrepener: 2050.92054724 hartree
electener: -3379.88989819 hartree
oneelecener: -5892.95723368 hartree
twoeener: 2513.06733550 hartree
kineticenergy: 1324.30887874 hartree
xcener: -107.433233699685 hartree
chargesum: 0.0000000
charge: -0.129524 -0.318373 -0.378202 0.008375 0.135300 -0.127033 -0.131633 -0.116670 -0.193593 -0.187776 -0.001815 -0.049997 -0.050574 0.243058 -0.167410 -0.243772 -0.277644 -0.006707 -0.069277 -0.094430 -0.249805 0.113325 0.107311 0.094010 0.082583 0.089407 0.089974 0.096685 0.086039 0.106787 0.111402 0.121871 0.096788 0.070980 0.080263 0.099157 0.092331 0.078965 0.085552 0.078909 0.118336 0.143806 0.069495 0.049399 0.084046 0.072741 0.087342
qa: -0.1295 -0.3184 -0.3782 0.0084 0.1353 -0.1270 -0.1316 -0.1167 -0.1936 -0.1878 -0.0018 -0.0500 -0.0506 0.2431 -0.1674 -0.2438 -0.2776 -0.0067 -0.0693 -0.0944 -0.2498 0.1133 0.1073 0.0940 0.0826 0.0894 0.0900 0.0967 0.0860 0.1068 0.1114 0.1219 0.0968 0.0710 0.0803 0.0992 0.0923 0.0790 0.0856 0.0789 0.1183 0.1438 0.0695 0.0494 0.0840 0.0727 0.0873
va: 1.1475 1.9632 2.1312 2.9097 3.6057 3.7512 3.7242 3.8126 3.8831 3.8814 3.9002 3.8484 3.8148 4.1656 4.0328 3.9296 3.9450 3.9331 3.9610 3.9267 3.9446 1.0491 0.9960 1.0010 1.0194 0.9935 1.0131 1.0011 1.0030 1.0076 1.0065 1.0036 1.0082 1.0062 1.0066 1.0117 1.0079 1.0035 1.0008 0.9794 1.0164 1.0087 1.0147 1.0181 1.0063 1.0079 1.0031
dispcorr: -0.031274349 hartree
energy: -1329.000625298168
dipole: 19.98258 -19.83931 0.14327 20.86581 -19.74638 1.11943 -14.04224 13.38697 -0.65527
magnitude: 1.30500 au
magnitude: 3.31705 debye
