program: Orca
programVersion: 5.0.2
elementType: Cl O O N C C C C C C C C C C C C C C C C C H H H H H H H H H H H H H H H H H H H H H H H H H H
charge: 0
multiplicity: 1
keywords: wb97x-d3
keywords: def2-TZVPP
keywords: def2/J RIJCOSX
keywords: DEFGRID2
keywords: scfconv7
keywords: smallprint printgap noloewdin
keywords: NOSOSCF
formula: C17H26ClNO2
InChI: InChI=1/C17H26ClNO2/c1-4-11-21-12-10-19(16(20)13-18)17-14(5-2)8-7-9-15(17)6-3/h7-9H,4-6,10-13H2,1-3H3
47 atoms
Cl -1.811197 -3.081588 2.559864
O  3.153757 0.335806 -0.952935
O  0.357396 -2.434449 0.753939
N  -0.275484 -0.374633 0.08397
C  -1.310497 0.601596 -0.005884
C  -2.315582 0.449329 -0.969818
C  -1.302209 1.699504 0.861976
C  0.884094 -0.246571 -0.792651
C  -2.333768 -0.6920 -1.952424
C  -0.206389 1.92474 1.867178
C  2.223002 -0.218125 -0.063554
C  -3.321403 1.406924 -1.037953
C  -2.327513 2.633704 0.76162
C  -0.446105 -1.535314 0.781707
C  -3.332529 2.490816 -0.178306
C  -1.802274 -0.280318 -3.3246
C  0.84998 2.898627 1.345582
C  4.471725 0.306065 -0.474229
C  -1.733735 -1.601263 1.600579
C  5.404454 0.85181 -1.536781
C  5.400146 0.034015 -2.820758
H  0.886895 -1.050105 -1.53464
H  0.768237 0.693833 -1.331832
H  -3.361582 -1.04686 -2.061168
H  -1.759535 -1.54313 -1.585111
H  -0.641762 2.32688 2.784889
H  0.26808 0.982059 2.141726
H  2.140506 0.387372 0.850954
H  2.516435 -1.227412 0.242713
H  -4.10942 1.294121 -1.773303
H  -2.336874 3.482263 1.435495
H  -4.127466 3.222488 -0.237915
H  -1.844731 -1.116221 -4.022812
H  -0.76665 0.05369 -3.267307
H  -2.387837 0.537219 -3.745639
H  0.413091 3.875351 1.136549
H  1.306055 2.541403 0.422122
H  1.646086 3.038235 2.077231
H  4.562963 0.901072 0.44722
H  4.765245 -0.722902 -0.214534
H  -2.60677 -1.570058 0.948306
H  -1.808828 -0.746873 2.273267
H  5.138558 1.890217 -1.751203
H  6.412027 0.875159 -1.11342
H  6.112743 0.433029 -3.542599
H  4.417306 0.032869 -3.289166
H  5.675782 -1.004176 -2.627082
totalener: -1328.97269420 hartree
nucrepener: 1914.05560056 hartree
electener: -3243.02829475 hartree
oneelecener: -5618.98920312 hartree
twoeener: 2375.96090837 hartree
kineticenergy: 1324.30533140 hartree
xcener: -107.422225008347 hartree
chargesum: 0.0000000
charge: -0.105391 -0.324549 -0.364519 -0.022085 0.117838 -0.175533 -0.101013 -0.076593 -0.193848 -0.216129 -0.012105 -0.035393 -0.032401 0.213857 -0.163173 -0.242881 -0.253806 0.017871 -0.080519 -0.106621 -0.236003 0.106569 0.110517 0.091346 0.094361 0.091145 0.089342 0.064471 0.119837 0.117293 0.115793 0.127360 0.092535 0.085948 0.080651 0.087004 0.086916 0.095101 0.070149 0.070134 0.125045 0.122285 0.059042 0.054707 0.082068 0.086483 0.066891
qa: -0.1054 -0.3245 -0.3645 -0.0221 0.1178 -0.1755 -0.1010 -0.0766 -0.1938 -0.2161 -0.0121 -0.0354 -0.0324 0.2139 -0.1632 -0.2429 -0.2538 0.0179 -0.0805 -0.1066 -0.2360 0.1066 0.1105 0.0913 0.0944 0.0911 0.0893 0.0645 0.1198 0.1173 0.1158 0.1274 0.0925 0.0859 0.0807 0.0870 0.0869 0.0951 0.0701 0.0701 0.1250 0.1223 0.0590 0.0547 0.0821 0.0865 0.0669
va: 1.1689 1.9632 2.1398 2.8461 3.6095 3.8370 3.8140 3.8470 3.8912 3.9114 3.9117 3.8639 3.8526 4.1693 4.0492 3.9180 3.9049 3.9260 4.0417 3.9477 3.9217 1.0099 1.0022 1.0007 1.0103 1.0024 1.0093 0.9860 1.0156 1.0035 1.0046 1.0013 1.0065 1.0039 1.0059 1.0084 1.0047 1.0059 0.9961 0.9924 1.0077 1.0074 1.0140 1.0122 1.0057 1.0141 1.0066
dispcorr: -0.025244165 hartree
energy: -1328.997938363973
dipole: 22.80302 -23.19885 -0.39583 19.81271 -18.12629 1.68642 -19.69977 19.24363 -0.45615
magnitude: 1.79130 au
magnitude: 4.55312 debye
