program: Orca
programVersion: 5.0.2
elementType: Cl O O N C C C C C C C C C C C C C C C C C H H H H H H H H H H H H H H H H H H H H H H H H H H
charge: 0
multiplicity: 1
keywords: wb97x-d3
keywords: def2-TZVPP
keywords: def2/J RIJCOSX
keywords: DEFGRID2
keywords: scfconv7
keywords: smallprint printgap noloewdin
keywords: NOSOSCF
formula: C17H26ClNO2
InChI: InChI=1/C17H26ClNO2/c1-4-11-21-12-10-19(16(20)13-18)17-14(5-2)8-7-9-15(17)6-3/h7-9H,4-6,10-13H2,1-3H3
47 atoms
Cl -2.878142 -2.175436 1.433509
O  2.338435 0.278168 -1.18414
O  0.390183 -3.066998 0.952774
N  -0.093959 -1.110541 -0.071088
C  -0.707597 0.175887 -0.044541
C  -1.846953 0.400646 -0.826262
C  -0.149581 1.198755 0.734748
C  0.730046 -1.469482 -1.217565
C  -2.472736 -0.661528 -1.691981
C  1.069765 1.011101 1.601792
C  2.195653 -1.110374 -1.084719
C  -2.420936 1.667324 -0.813966
C  -0.753484 2.450805 0.710504
C  -0.230033 -2.025935 0.927485
C  -1.879345 2.68897 -0.05693
C  -2.313458 -0.37747 -3.184773
C  0.814162 1.276327 3.08401
C  3.651565 0.726564 -0.988204
C  -1.249851 -1.718612 2.012523
C  3.708186 2.227034 -1.194092
C  5.109719 2.775936 -0.967584
H  0.646156 -2.543532 -1.381378
H  0.324411 -0.969929 -2.097885
H  -3.536727 -0.720556 -1.450885
H  -2.067018 -1.64425 -1.457029
H  1.485114 0.012166 1.484502
H  1.847147 1.694347 1.252273
H  2.591998 -1.496128 -0.13501
H  2.751013 -1.619198 -1.888056
H  -3.310605 1.849759 -1.405144
H  -0.328484 3.25572 1.298216
H  -2.335363 3.670323 -0.062256
H  -2.783201 -1.161735 -3.778573
H  -1.2642 -0.323746 -3.476056
H  -2.773529 0.569999 -3.466046
H  0.061137 0.604394 3.495782
H  0.469863 2.294373 3.263997
H  1.728424 1.134131 3.660425
H  4.00235 0.473754 0.025357
H  4.342711 0.230574 -1.688353
H  -1.29585 -0.672661 2.299589
H  -1.024438 -2.331299 2.880886
H  3.370848 2.463159 -2.205846
H  3.00261 2.711562 -0.514226
H  5.830899 2.330568 -1.654709
H  5.458776 2.577976 0.047194
H  5.140198 3.85433 -1.118216
totalener: -1328.97302231 hartree
nucrepener: 1987.61462597 hartree
electener: -3316.58764828 hartree
oneelecener: -5766.39327474 hartree
twoeener: 2449.80562646 hartree
kineticenergy: 1324.30392426 hartree
xcener: -107.424897706298 hartree
chargesum: -0.0000000
charge: -0.130168 -0.302752 -0.383205 -0.006085 0.130082 -0.102457 -0.128325 -0.033264 -0.221008 -0.225177 -0.035378 -0.047070 -0.047368 0.258460 -0.172664 -0.231321 -0.225553 -0.007309 -0.093247 -0.080103 -0.254908 0.105969 0.098978 0.094769 0.081184 0.086854 0.085993 0.092495 0.082666 0.111794 0.111770 0.123123 0.089433 0.079008 0.075909 0.072796 0.078650 0.090660 0.071661 0.076299 0.121738 0.147039 0.067321 0.054547 0.075277 0.074113 0.088774
qa: -0.1302 -0.3028 -0.3832 -0.0061 0.1301 -0.1025 -0.1283 -0.0333 -0.2210 -0.2252 -0.0354 -0.0471 -0.0474 0.2585 -0.1727 -0.2313 -0.2256 -0.0073 -0.0932 -0.0801 -0.2549 0.1060 0.0990 0.0948 0.0812 0.0869 0.0860 0.0925 0.0827 0.1118 0.1118 0.1231 0.0894 0.0790 0.0759 0.0728 0.0786 0.0907 0.0717 0.0763 0.1217 0.1470 0.0673 0.0545 0.0753 0.0741 0.0888
va: 1.1469 1.9784 2.1244 2.9546 3.7810 3.7788 3.7469 3.8600 3.9165 3.9432 3.9535 3.8658 3.8462 4.1361 4.0625 3.9282 3.9227 3.9263 3.9807 3.9000 3.9463 1.0240 1.0163 1.0013 1.0204 1.0053 1.0046 0.9986 1.0044 1.0051 1.0042 1.0025 1.0068 1.0053 1.0075 1.0119 1.0074 1.0074 0.9899 0.9992 1.0189 1.0047 1.0143 1.0133 1.0043 1.0031 1.0059
dispcorr: -0.027595061 hartree
energy: -1329.000617368956
dipole: 24.71493 -24.16771 0.54722 18.85207 -17.55558 1.29650 -9.64550 9.33979 -0.30571
magnitude: 1.44007 au
magnitude: 3.66037 debye
