program: Gaussian 09
title: 000056161
version: EM64L-G09RevD.01
frameworkgroup: C1[X(C13H7Cl5O2)]
method: RPBEPBE
basis: SDD
operation: Freq
keyword: #p
keyword: freq=noraman
keyword: PBEPBE/SDD
title: #p freq=noraman PBEPBE/SDD
converged: YES YES NO NO
title: Mulliken charges:
elementType: Cl Cl Cl Cl Cl O O C C C C C C C C C C C C C H H H H H H H
charge: -0.012569 -0.017030 0.015309 0.011351 -0.017406 -0.273545 -0.260325 0.433357 0.519546 -0.330984 -0.429007 0.508261 -0.213804 -0.242731 -0.240610 -0.238626 -0.225361 -0.225572 -0.097742 -0.514358 0.282786 0.289043 0.288846 0.288546 0.230180 0.229761 0.242683
chargesum: 0.00000
title: Mulliken charges with hydrogens summed into heavy atoms:
elementType: Cl Cl Cl Cl Cl O O C C C C C C C C C C C C C
charge: -0.012569 -0.017030 0.015309 0.011351 -0.017406 -0.273545 -0.260325 0.433357 0.519546 -0.048198 -0.139964 0.508261 -0.213804 -0.242731 -0.240610 -0.238626 0.063486 0.062974 -0.097742 0.188265
polarizability: 2.82979721e+02 -2.67185723e+01 1.65399971e+02 1.13929455e+01 9.76021679e-01 1.54222117e+02
1716.lowfreq: -7.4759 -3.6873 -0.0012 -0.0011 0.0009 4.1988 13.2620 14.8034 29.0981
frequency: 13.0060 14.7148 29.0876 53.2257 67.9393 78.1928 125.9221 136.7897 142.1324 155.6042 172.8235 180.1284 195.4858 196.8956 201.3111 212.2967 259.7940 276.5437 306.5707 349.4935 349.9034 383.8903 408.4785 410.7969 444.8874 492.8841 505.7981 506.6252 541.1329 551.8693 579.1537 589.8656 658.7942 720.4664 734.5945 744.0801 759.7482 763.3701 819.6398 849.6744 853.9582 862.1615 864.0103 911.7468 948.4724 1041.0218 1049.5599 1106.9245 1108.4323 1150.0044 1163.5293 1180.1295 1182.9954 1220.4250 1257.6646 1343.7357 1347.3824 1370.8206 1399.4903 1413.9143 1423.3068 1453.8015 1463.9673 1466.0481 1556.8039 1561.2721 1571.7339 1601.0317 2976.1072 3073.2088 3132.9994 3176.1969 3188.4808 3189.8650 3190.0693
redmass: 13.7666 16.5530 17.0612 3.0066 5.4419 18.1375 11.1214 12.7408 18.5766 1.0811 18.3732 13.6969 5.5499 6.2207 5.8294 7.1948 9.1623 12.5656 10.1837 15.9544 31.7657 9.9059 8.0932 8.0656 7.9423 10.1796 5.1116 5.0493 7.3272 5.4716 4.1885 3.6220 6.5429 7.0796 8.8093 6.3661 11.2096 11.2412 8.1340 1.4500 1.4225 1.3630 1.4425 9.2093 9.1340 2.6670 3.4392 2.9204 1.2335 1.3570 2.3164 1.5300 1.4870 3.9051 7.0791 5.8905 6.0177 4.6235 4.7491 1.8362 3.0514 1.8386 1.0529 1.0568 9.6045 9.2789 8.4059 7.9250 1.0306 1.1055 1.1018 1.0924 1.0933 1.0941 1.0934
irintensity: 0.1301 0.2153 0.0450 5.3738 1.2139 0.1552 0.7736 0.2088 0.0803 0.1846 0.8740 0.8946 0.4309 0.5129 0.3418 2.7616 1.4259 1.6011 1.9906 1.7656 0.1057 6.1724 3.1225 4.0407 6.1922 7.4735 0.1106 0.0101 4.9593 5.7705 12.8690 9.5680 0.8732 18.2375 2.7364 35.7253 71.2198 114.9415 24.5346 19.6670 42.0705 0.6895 22.6316 109.4664 35.6494 5.3042 31.4380 65.1317 0.0069 4.6439 94.6646 6.4698 5.4794 198.2792 27.6856 25.4299 13.3579 26.8894 13.3088 274.6979 202.0785 153.5368 12.1162 4.1409 69.5351 40.8735 46.6075 157.4368 56.8918 27.4041 22.2075 0.6850 3.4976 1.3336 1.7967
temp: 298.150 k
press: 1.00000 atm
elementType: 17 17 17 17 17 8 8 6 6 6 6 6 6 6 6 6 6 6 6 6 1 1 1 1 1 1 1
symmnumber: 1
zpe: 429368.9 jmol-1
zpe.correction: 0.163538 hartree
zpe.thermalcorrener: 0.183525 hartree
zpe.thermalcorrenthalpy: 0.184469 hartree
zpe.thermalcorrgfe: 0.110680 hartree
zpe.sumelectzpe: -2948.859170 hartree
zpe.sumelectthermal: -2948.839183 hartree
zpe.sumelectthermalent: -2948.838239 hartree
zpe.sumelectthermalfe: -2948.912028 hartree
dipole: -1.5626 1.0512 1.6007
dipole: 2.4717
quadrupole: -144.7880 -150.2234 -149.6170
quadrupole: 4.0424 9.1659 3.6463
quadrupole: 3.4215 -2.0140 -1.4075 4.0424 9.1659 3.6463
hfenergy: -2949.0227081 hartree
pointgroup: C01 [X(C13H7Cl5O2)]
dipole: -0.616249 -0.3498637 -0.6659118 debye
polarizability: 282.0049028|29.4798789|165.8526654|-9.5979816|1.7862404|154.7442411 unknown
InChI: InChI=1S/C13H7Cl5O2/c1-19-12-10(17)4-7(5-11(12)18)20-13-8(15)2-6(14)3-9(13)16/h2-5H,1H3
charge 0 multiplicity 1
27 atoms
Cl 4.5476 1.959331 -0.247069
Cl 2.162906 -2.971628 0.745179
Cl -1.70657 1.395577 2.542752
Cl -1.559174 0.166898 -2.8751
Cl -5.977648 -1.237755 0.171139
O  -0.57868 1.406959 -0.275468
O  4.474686 -0.998987 0.493771
C  0.656403 0.728465 -0.097799
C  -1.784735 0.700903 -0.151024
C  0.747305 -0.646675 0.200434
C  1.804248 1.534934 -0.239245
C  3.219198 -0.443733 0.233781
C  3.061811 0.934372 -0.07413
C  2.029561 -1.204097 0.356697
C  -2.479332 0.665283 1.083104
C  -2.413215 0.127459 -1.283511
C  -3.754442 0.079537 1.201594
C  -3.686556 -0.46834 -1.204229
C  -4.334364 -0.479317 0.046234
C  5.171507 -1.566756 -0.68512
H  -0.143197 -1.270191 0.310418
H  1.70005 2.597286 -0.469133
H  -4.274118 0.064976 2.162139
H  -4.154187 -0.904083 -2.089716
H  5.358118 -0.781466 -1.440757
H  4.580897 -2.39203 -1.124032
H  6.125828 -1.95092 -0.296809
