program: Orca
programVersion: 5.0.2
elementType: Cl O O N C C C C C C C C C C C C C C C C C H H H H H H H H H H H H H H H H H H H H H H H H H H
charge: 0
multiplicity: 1
keywords: wb97x-d3
keywords: def2-TZVPP
keywords: def2/J RIJCOSX
keywords: DEFGRID2
keywords: scfconv7
keywords: smallprint printgap noloewdin
keywords: NOSOSCF
formula: C17H26ClNO2
InChI: InChI=1/C17H26ClNO2/c1-4-11-21-12-10-19(16(20)13-18)17-14(5-2)8-7-9-15(17)6-3/h7-9H,4-6,10-13H2,1-3H3
47 atoms
Cl -2.369991 -1.349489 2.501483
O  2.295294 -0.344675 -1.678521
O  0.018247 -3.28263 1.092226
N  0.306603 -1.157335 0.383774
C  -0.246015 0.123407 0.093681
C  -0.761712 0.380315 -1.181945
C  -0.244667 1.105417 1.095865
C  1.755679 -1.359436 0.403869
C  -0.760579 -0.638856 -2.292222
C  0.373705 0.83281 2.444973
C  2.553423 -0.288492 -0.304715
C  -1.304842 1.637797 -1.430284
C  -0.795523 2.347046 0.80155
C  -0.45636 -2.2091 0.792046
C  -1.326546 2.610915 -0.449988
C  -2.158664 -1.017077 -2.777944
C  -0.198156 1.644431 3.598935
C  3.109482 0.462802 -2.496388
C  -1.95873 -1.989891 0.88376
C  2.473783 1.787038 -2.892011
C  2.265677 2.773789 -1.753205
H  2.107008 -1.417172 1.43912
H  1.977488 -2.324638 -0.052824
H  -0.219305 -1.533565 -1.992653
H  -0.195817 -0.226332 -3.131395
H  0.270903 -0.224346 2.68737
H  1.452276 1.017139 2.379996
H  2.346744 0.703231 0.116052
H  3.612883 -0.5002 -0.096462
H  -1.707089 1.857762 -2.412033
H  -0.816267 3.120869 1.556925
H  -1.750197 3.584093 -0.661449
H  -2.758319 -1.470966 -1.988788
H  -2.096037 -1.737349 -3.593554
H  -2.711618 -0.153075 -3.146521
H  0.234884 1.307642 4.540203
H  -1.278786 1.520032 3.665971
H  0.016473 2.709547 3.512463
H  4.082372 0.647101 -2.018136
H  3.311836 -0.115175 -3.402749
H  -2.449281 -2.954314 0.779924
H  -2.356679 -1.292137 0.153625
H  3.121233 2.237256 -3.650808
H  1.518913 1.590518 -3.387057
H  3.197217 2.968575 -1.217827
H  1.527952 2.41805 -1.035272
H  1.902006 3.729105 -2.132004
totalener: -1328.96715468 hartree
nucrepener: 2037.73073830 hartree
electener: -3366.69789298 hartree
oneelecener: -5866.61169077 hartree
twoeener: 2499.91379779 hartree
kineticenergy: 1324.29954309 hartree
xcener: -107.430116684229 hartree
chargesum: -0.0000000
charge: -0.131252 -0.311843 -0.378247 -0.005109 0.122452 -0.163386 -0.160433 -0.063001 -0.163292 -0.183362 -0.013470 -0.041652 -0.021090 0.254053 -0.184370 -0.230070 -0.260359 -0.012900 -0.088591 -0.083213 -0.243546 0.097240 0.113680 0.089310 0.077571 0.101431 0.076498 0.083098 0.090142 0.109998 0.116258 0.122236 0.070820 0.093006 0.075039 0.091214 0.095337 0.075085 0.064916 0.090914 0.149253 0.119763 0.072426 0.057523 0.088247 0.050560 0.091115
qa: -0.1313 -0.3118 -0.3782 -0.0051 0.1225 -0.1634 -0.1604 -0.0630 -0.1633 -0.1834 -0.0135 -0.0417 -0.0211 0.2541 -0.1844 -0.2301 -0.2604 -0.0129 -0.0886 -0.0832 -0.2435 0.0972 0.1137 0.0893 0.0776 0.1014 0.0765 0.0831 0.0901 0.1100 0.1163 0.1222 0.0708 0.0930 0.0750 0.0912 0.0953 0.0751 0.0649 0.0909 0.1493 0.1198 0.0724 0.0575 0.0882 0.0506 0.0911
va: 1.1496 1.9738 2.1372 2.9204 3.5848 3.7726 3.7953 3.8736 3.8908 3.8861 3.9481 3.7923 3.8006 4.1421 4.0671 3.9187 3.9465 3.9542 3.9737 3.8368 3.9202 1.0060 1.0238 1.0213 1.0089 1.0081 0.9969 0.9729 1.0012 1.0059 1.0041 1.0048 1.0119 1.0063 1.0073 1.0069 1.0103 1.0006 1.0012 0.9992 1.0044 1.0200 1.0174 1.0092 1.0091 0.9970 1.0092
dispcorr: -0.030757008 hartree
energy: -1328.997911685395
dipole: 14.97316 -14.47020 0.50296 16.84754 -15.36142 1.48612 -16.07657 15.16272 -0.91384
magnitude: 1.81566 au
magnitude: 4.61505 debye
