program: Orca
programVersion: 5.0.2
elementType: Cl O O N C C C C C C C C C C C C C C C C C H H H H H H H H H H H H H H H H H H H H H H H H H H
charge: 0
multiplicity: 1
keywords: wb97x-d3
keywords: def2-TZVPP
keywords: def2/J RIJCOSX
keywords: DEFGRID2
keywords: scfconv7
keywords: smallprint printgap noloewdin
keywords: NOSOSCF
formula: C17H26ClNO2
InChI: InChI=1/C17H26ClNO2/c1-4-11-21-12-10-19(16(20)13-18)17-14(5-2)8-7-9-15(17)6-3/h7-9H,4-6,10-13H2,1-3H3
47 atoms
Cl -0.542566 -2.664009 1.42963
O  1.9919 -0.092229 -1.901317
O  1.867107 -0.335721 2.052839
N  0.386224 0.472311 0.547572
C  -0.980518 0.798101 0.283319
C  -1.700574 0.103263 -0.693579
C  -1.577468 1.82584 1.030795
C  1.424355 1.305348 -0.057056
C  -1.109643 -0.983223 -1.550287
C  -0.83113 2.626898 2.06693
C  2.526184 0.556242 -0.782334
C  -3.037979 0.442728 -0.887776
C  -2.912808 2.13099 0.800614
C  0.733641 -0.285594 1.625252
C  -3.644075 1.441672 -0.151246
C  -1.016964 -0.576727 -3.01881
C  -0.422291 4.006008 1.550844
C  2.925884 -0.805536 -2.670947
C  -0.362914 -1.105753 2.288347
C  3.501754 -2.040467 -1.989061
C  2.439467 -2.994346 -1.4632
H  0.926967 1.974986 -0.758536
H  1.895558 1.92707 0.711173
H  -1.731871 -1.87635 -1.455553
H  -0.121664 -1.257862 -1.195545
H  -1.473745 2.753883 2.941773
H  0.054681 2.101358 2.424318
H  3.279115 1.300867 -1.086395
H  3.022957 -0.13627 -0.09797
H  -3.613155 -0.099661 -1.628613
H  -3.385278 2.912379 1.384718
H  -4.687322 1.679849 -0.31254
H  -0.383458 0.299931 -3.140996
H  -1.995475 -0.348902 -3.443436
H  -0.582574 -1.384651 -3.608729
H  -1.292842 4.585147 1.242814
H  0.239707 3.928712 0.688797
H  0.099471 4.571041 2.323418
H  2.38897 -1.108998 -3.573316
H  3.746147 -0.145282 -2.991364
H  -1.337436 -0.625095 2.297233
H  -0.050673 -1.326531 3.305672
H  4.12791 -2.549397 -2.727787
H  4.179073 -1.755958 -1.179109
H  1.736337 -3.278138 -2.248712
H  1.861915 -2.554892 -0.650461
H  2.89091 -3.90879 -1.07907
totalener: -1328.97108937 hartree
nucrepener: 2015.50611169 hartree
electener: -3344.47720106 hartree
oneelecener: -5822.51374810 hartree
twoeener: 2478.03654704 hartree
kineticenergy: 1324.29855107 hartree
xcener: -107.423429678632 hartree
chargesum: 0.0000000
charge: -0.124841 -0.309279 -0.384697 0.030788 0.006556 -0.043504 -0.105224 -0.072961 -0.108753 -0.192672 -0.033911 -0.059948 -0.045460 0.213469 -0.161010 -0.257534 -0.243513 -0.011565 -0.076322 -0.105969 -0.222514 0.104685 0.096246 0.092368 0.009552 0.089299 0.089137 0.073377 0.111118 0.114109 0.114989 0.124843 0.086894 0.080290 0.078320 0.081763 0.083005 0.091516 0.082203 0.076060 0.127785 0.143251 0.065093 0.064649 0.069444 0.063929 0.094936
qa: -0.1248 -0.3093 -0.3847 0.0308 0.0066 -0.0435 -0.1052 -0.0730 -0.1088 -0.1927 -0.0339 -0.0599 -0.0455 0.2135 -0.1610 -0.2575 -0.2435 -0.0116 -0.0763 -0.1060 -0.2225 0.1047 0.0962 0.0924 0.0096 0.0893 0.0891 0.0734 0.1111 0.1141 0.1150 0.1248 0.0869 0.0803 0.0783 0.0818 0.0830 0.0915 0.0822 0.0761 0.1278 0.1433 0.0651 0.0646 0.0694 0.0639 0.0949
va: 1.1467 1.9532 2.1175 2.9041 3.7164 3.8744 3.8012 3.9245 3.8288 3.8850 3.9661 3.8621 3.8795 4.1731 4.0355 3.9327 3.9123 3.9315 3.9585 3.8522 3.9296 1.0015 1.0084 1.0058 1.0719 1.0026 1.0160 1.0013 0.9989 1.0051 1.0044 1.0021 1.0159 1.0124 1.0073 1.0066 1.0030 1.0063 0.9925 1.0052 1.0067 1.0070 1.0160 1.0071 1.0051 1.0141 1.0093
dispcorr: -0.029510629 hartree
energy: -1329.000599998662
dipole: 9.29498 -9.75611 -0.46113 9.75344 -8.85591 0.89752 -15.16316 14.80375 -0.35941
magnitude: 1.07115 au
magnitude: 2.72265 debye
