program: Orca
programVersion: 5.0.2
elementType: Cl O O N C C C C C C C C C C C C C C C C C H H H H H H H H H H H H H H H H H H H H H H H H H H
charge: 0
multiplicity: 1
keywords: wb97x-d3
keywords: def2-TZVPP
keywords: def2/J RIJCOSX
keywords: DEFGRID2
keywords: scfconv7
keywords: smallprint printgap noloewdin
keywords: NOSOSCF
formula: C17H26ClNO2
InChI: InChI=1/C17H26ClNO2/c1-4-11-21-12-10-19(16(20)13-18)17-14(5-2)8-7-9-15(17)6-3/h7-9H,4-6,10-13H2,1-3H3
47 atoms
Cl -2.040352 -1.585664 2.523956
O  2.046816 -0.331272 -2.184075
O  0.356315 -3.175542 0.638136
N  0.343062 -0.94476 0.279415
C  -0.371302 0.27338 0.091698
C  -1.039437 0.516927 -1.115146
C  -0.343785 1.228893 1.118778
C  1.797022 -0.921562 0.178847
C  -1.101392 -0.478127 -2.246639
C  0.388832 0.972799 2.412368
C  2.341682 -1.283722 -1.195372
C  -1.669391 1.746854 -1.279234
C  -0.985309 2.443036 0.90673
C  -0.256948 -2.132464 0.564709
C  -1.639842 2.704323 -0.283928
C  -2.523989 -0.825288 -2.680833
C  -0.276511 1.565455 3.648285
C  3.112425 0.488908 -2.593165
C  -1.752687 -2.1048 0.837932
C  3.494502 1.586384 -1.609442
C  2.377153 2.58176 -1.335843
H  2.138571 0.07368 0.464606
H  2.204931 -1.62559 0.905907
H  -0.572894 -1.394097 -1.990573
H  -0.555552 -0.065495 -3.097323
H  0.500418 -0.100097 2.563411
H  1.406658 1.370224 2.328337
H  3.42606 -1.436874 -1.099593
H  1.917769 -2.243148 -1.504577
H  -2.179744 1.961921 -2.209972
H  -0.976681 3.198331 1.681108
H  -2.127754 3.658376 -0.434815
H  -2.505186 -1.556815 -3.488615
H  -3.069162 0.04487 -3.04529
H  -3.10917 -1.25263 -1.865986
H  -0.272492 2.655278 3.647949
H  0.250916 1.245447 4.546488
H  -1.310497 1.232366 3.730811
H  3.998861 -0.121234 -2.820156
H  2.793751 0.945368 -3.534384
H  -2.138518 -3.115076 0.733331
H  -2.309253 -1.429528 0.194447
H  3.848951 1.144284 -0.67267
H  4.359878 2.108733 -2.028399
H  2.077936 3.09548 -2.251089
H  2.693419 3.342642 -0.622088
H  1.487288 2.099553 -0.932588
totalener: -1328.96891379 hartree
nucrepener: 2030.43227303 hartree
electener: -3359.40118683 hartree
oneelecener: -5852.11542753 hartree
twoeener: 2492.71424070 hartree
kineticenergy: 1324.30116665 hartree
xcener: -107.429696276489 hartree
chargesum: -0.0000000
charge: -0.132009 -0.321975 -0.382079 0.025369 0.127148 -0.185134 -0.117294 -0.058606 -0.186663 -0.217799 -0.024740 -0.029858 -0.027887 0.237800 -0.178959 -0.226900 -0.251867 0.002853 -0.068418 -0.105547 -0.202051 0.083398 0.108041 0.077953 0.095043 0.100226 0.086531 0.082302 0.112366 0.113356 0.114065 0.123433 0.092774 0.076672 0.068926 0.076420 0.089024 0.090804 0.074008 0.074739 0.146835 0.115484 0.053538 0.071622 0.077804 0.086240 0.033013
qa: -0.1320 -0.3220 -0.3821 0.0254 0.1271 -0.1851 -0.1173 -0.0586 -0.1867 -0.2178 -0.0247 -0.0299 -0.0279 0.2378 -0.1790 -0.2269 -0.2519 0.0029 -0.0684 -0.1055 -0.2021 0.0834 0.1080 0.0780 0.0950 0.1002 0.0865 0.0823 0.1124 0.1134 0.1141 0.1234 0.0928 0.0767 0.0689 0.0764 0.0890 0.0908 0.0740 0.0747 0.1468 0.1155 0.0535 0.0716 0.0778 0.0862 0.0330
va: 1.1493 1.9535 2.1243 2.9070 3.6437 3.7942 3.7188 3.8578 3.9165 3.8853 3.8999 3.8372 3.8295 4.1626 4.0701 3.9133 3.9395 3.9446 3.9748 3.8314 3.9286 1.0018 1.0310 1.0127 1.0111 1.0102 0.9964 1.0028 1.0097 1.0032 1.0048 1.0036 1.0062 1.0083 1.0100 1.0024 1.0067 1.0135 1.0010 0.9973 1.0058 1.0261 1.0074 1.0169 1.0105 1.0087 1.0146
dispcorr: -0.030118559 hartree
energy: -1328.999032350833
dipole: 13.89403 -13.51906 0.37497 15.87821 -14.64852 1.22968 -13.74727 13.07245 -0.67482
magnitude: 1.45193 au
magnitude: 3.69052 debye
