program: Orca
programVersion: 5.0.2
elementType: Cl O O N C C C C C C C C C C C C C C C C C H H H H H H H H H H H H H H H H H H H H H H H H H H
charge: 0
multiplicity: 1
keywords: wb97x-d3
keywords: def2-TZVPP
keywords: def2/J RIJCOSX
keywords: DEFGRID2
keywords: scfconv7
keywords: smallprint printgap noloewdin
keywords: NOSOSCF
formula: C17H26ClNO2
InChI: InChI=1/C17H26ClNO2/c1-4-11-21-12-10-19(16(20)13-18)17-14(5-2)8-7-9-15(17)6-3/h7-9H,4-6,10-13H2,1-3H3
47 atoms
Cl -1.446418 -3.09091 2.511241
O  2.552803 0.302518 -0.243051
O  0.184524 -2.666979 0.165209
N  -0.279539 -0.496809 -0.264293
C  -1.222975 0.566603 -0.125033
C  -2.400868 0.5283 -0.886474
C  -0.974561 1.618651 0.76462
C  0.623021 -0.480412 -1.411131
C  -2.703507 -0.571467 -1.871057
C  0.273844 1.711504 1.599804
C  2.093568 -0.701383 -1.103636
C  -3.325605 1.555097 -0.73873
C  -1.929928 2.624336 0.883023
C  -0.434372 -1.664247 0.426488
C  -3.095536 2.598427 0.140601
C  -2.468669 -0.137665 -3.317367
C  1.187651 2.849687 1.15037
C  3.834081 0.083418 0.290263
C  -1.456152 -1.602712 1.559335
C  4.966063 0.274924 -0.710002
C  4.964281 1.649847 -1.361924
H  0.322993 -1.239584 -2.140952
H  0.502809 0.492224 -1.888998
H  -3.749508 -0.866474 -1.756478
H  -2.117804 -1.467547 -1.664209
H  -0.01451 1.872501 2.642484
H  0.829601 0.777798 1.564692
H  2.253135 -1.695278 -0.674117
H  2.618791 -0.680024 -2.07049
H  -4.243577 1.527144 -1.314159
H  -1.755805 3.436035 1.579539
H  -3.830191 3.384726 0.254738
H  -2.698187 -0.949742 -4.007374
H  -1.432896 0.157633 -3.482497
H  -3.096777 0.712986 -3.582061
H  0.693387 3.818683 1.229414
H  1.501629 2.712417 0.117821
H  2.085675 2.885104 1.767737
H  3.94458 0.805569 1.10383
H  3.897344 -0.919325 0.736079
H  -2.460635 -1.457791 1.160397
H  -1.251343 -0.764653 2.224703
H  5.905699 0.118691 -0.172913
H  4.93341 -0.504847 -1.476336
H  4.050593 1.824113 -1.929384
H  5.80521 1.763273 -2.045432
H  5.038501 2.440964 -0.613924
totalener: -1328.97133989 hartree
nucrepener: 1954.76535596 hartree
electener: -3283.73669585 hartree
oneelecener: -5700.77054676 hartree
twoeener: 2417.03385091 hartree
kineticenergy: 1324.30329356 hartree
xcener: -107.424556064794 hartree
chargesum: 0.0000000
charge: -0.108677 -0.327676 -0.372446 -0.011552 0.099074 -0.159732 -0.097767 -0.076750 -0.194416 -0.183905 -0.017181 -0.032398 -0.043272 0.233397 -0.169687 -0.243669 -0.254639 0.001322 -0.087785 -0.114255 -0.238988 0.096175 0.104889 0.092394 0.092874 0.095166 0.083469 0.110704 0.074807 0.116506 0.114970 0.125702 0.092703 0.082199 0.081037 0.082331 0.088557 0.079625 0.077051 0.090072 0.126444 0.124027 0.067740 0.062852 0.078559 0.089061 0.071084
qa: -0.1087 -0.3277 -0.3724 -0.0116 0.0991 -0.1597 -0.0978 -0.0768 -0.1944 -0.1839 -0.0172 -0.0324 -0.0433 0.2334 -0.1697 -0.2437 -0.2546 0.0013 -0.0878 -0.1143 -0.2390 0.0962 0.1049 0.0924 0.0929 0.0952 0.0835 0.1107 0.0748 0.1165 0.1150 0.1257 0.0927 0.0822 0.0810 0.0823 0.0886 0.0796 0.0771 0.0901 0.1264 0.1240 0.0677 0.0629 0.0786 0.0891 0.0711
va: 1.1663 1.9389 2.1357 2.9131 3.6183 3.8154 3.8154 3.9402 3.8835 3.8503 3.9508 3.8646 3.8536 4.1483 4.0515 3.9151 3.9280 3.9179 4.0443 3.8677 3.9261 1.0073 0.9977 1.0013 1.0134 0.9956 1.0395 1.0104 0.9888 1.0036 1.0043 1.0022 1.0060 1.0034 1.0067 1.0116 1.0138 1.0080 0.9928 1.0065 1.0054 1.0091 1.0169 1.0054 1.0093 1.0063 1.0054
dispcorr: -0.026854217 hartree
energy: -1328.998194108764
dipole: 19.97722 -20.02091 -0.04368 21.54772 -20.06939 1.47833 -17.87702 17.14784 -0.72918
magnitude: 1.64897 au
magnitude: 4.19134 debye
